Package Details: freshplayerplugin 0.3.8-1

Git Clone URL: https://aur.archlinux.org/freshplayerplugin.git (read-only)
Package Base: freshplayerplugin
Description: PPAPI-host NPAPI-plugin adapter.
Upstream URL: https://github.com/i-rinat/freshplayerplugin
Licenses: MIT
Submitter: WorMzy
Maintainer: WorMzy
Last Packager: WorMzy
Votes: 5
Popularity: 2.367193
First Submitted: 2017-09-04 10:03
Last Updated: 2017-12-11 21:57

Dependencies (23)

Required by (0)

Sources (1)

Latest Comments

WorMzy commented on 2017-11-22 14:16

Builds fine in a clean chroot.

If I had to hazard a guess, I'd say you have remnants of icu 58 on your system. Clean that up, then try again (or build in a clean chroot)

danmilon commented on 2017-11-22 13:06

It fails to build on an up to date system:

Scanning dependencies of target dep_check
[100%] Building C object src/CMakeFiles/dep_check.dir/dep_check.c.o
[100%] Linking CXX executable dep_check
../libfreshwrapper-flashplayer.so: undefined reference to `ucnv_close_58'
../libfreshwrapper-flashplayer.so: undefined reference to `UCNV_TO_U_CALLBACK_SUBSTITUTE_58'
../libfreshwrapper-flashplayer.so: undefined reference to `UCNV_FROM_U_CALLBACK_SUBSTITUTE_58'
../libfreshwrapper-flashplayer.so: undefined reference to `ucnv_setToUCallBack_58'
../libfreshwrapper-flashplayer.so: undefined reference to `UCNV_TO_U_CALLBACK_SKIP_58'
../libfreshwrapper-flashplayer.so: undefined reference to `ucnv_setFromUCallBack_58'
../libfreshwrapper-flashplayer.so: undefined reference to `UCNV_FROM_U_CALLBACK_SKIP_58'
../libfreshwrapper-flashplayer.so: undefined reference to `UCNV_TO_U_CALLBACK_STOP_58'
../libfreshwrapper-flashplayer.so: undefined reference to `ucnv_fromUChars_58'
../libfreshwrapper-flashplayer.so: undefined reference to `ucnv_open_58'
../libfreshwrapper-flashplayer.so: undefined reference to `ucnv_toUChars_58'
../libfreshwrapper-flashplayer.so: undefined reference to `UCNV_FROM_U_CALLBACK_STOP_58'
../libfreshwrapper-flashplayer.so: undefined reference to `ucnv_setSubstString_58'
collect2: error: ld returned 1 exit status
make[2]: *** [src/CMakeFiles/dep_check.dir/build.make:97: src/dep_check] Error 1
make[1]: *** [CMakeFiles/Makefile2:438: src/CMakeFiles/dep_check.dir/all] Error 2
make: *** [Makefile:130: all] Error 2