Package Details: fs-uae-git r1272.a48fa6c0-1

Git Clone URL: https://aur.archlinux.org/fs-uae-git.git (read-only, click to copy)
Package Base: fs-uae-git
Description: Cross-platform Amiga emulator based on UAE/WinUAE (GIT version).
Upstream URL: http://fs-uae.net/download-devel
Licenses: GPL2
Conflicts: fs-uae, fs-uae-devel
Provides: fs-uae, fs-uae-devel
Submitter: Enverex
Maintainer: Enverex
Last Packager: Enverex
Votes: 2
Popularity: 0.196022
First Submitted: 2018-04-23 07:54
Last Updated: 2018-04-23 08:52

Latest Comments

FredBezies commented on 2020-07-14 19:33

Broken. Build process stops with:

src/sana2.cpp:136:46: error: narrowing conversion of '-2146762751' from 'int' to 'unsigned int' [-Wnarrowing]
  136 | #define S2_CopyToBuff           (S2_Dummy + 1)
      |                                              ^
src/sana2.cpp:494:9: note: in expansion of macro 'S2_CopyToBuff'
  494 |    case S2_CopyToBuff:
      |         ^~~~~~~~~~~~~
src/sana2.cpp:137:46: error: narrowing conversion of '-2146762750' from 'int' to 'unsigned int' [-Wnarrowing]
  137 | #define S2_CopyFromBuff         (S2_Dummy + 2)
      |                                              ^
src/sana2.cpp:497:9: note: in expansion of macro 'S2_CopyFromBuff'
  497 |    case S2_CopyFromBuff:
      |         ^~~~~~~~~~~~~~~
src/sana2.cpp:138:46: error: narrowing conversion of '-2146762749' from 'int' to 'unsigned int' [-Wnarrowing]
  138 | #define S2_PacketFilter         (S2_Dummy + 3)
      |                                              ^
src/sana2.cpp:500:9: note: in expansion of macro 'S2_PacketFilter'
  500 |    case S2_PacketFilter:
      |         ^~~~~~~~~~~~~~~
make[2]: *** [Makefile:5540: src/sana2.o] Error 1
make[2]: *** Waiting for unfinished jobs....
make[2]: Leaving directory '/home/fred/fs-uae-git/src/fs-uae'
make[1]: *** [Makefile:5583: all-recursive] Error 1
make[1]: Leaving directory '/home/fred/fs-uae-git/src/fs-uae'
make: *** [Makefile:3415: all] Error 2
==> ERROR: A failure occurred in build().