Package Details: fsharp 4.5.0-3

Git Clone URL: https://aur.archlinux.org/fsharp.git (read-only)
Package Base: fsharp
Description: The F# Compiler, Core Library & Tools (F# Software Foundation Repository)
Upstream URL: http://fsharp.org/
Licenses: MIT
Submitter: arojas
Maintainer: brettgilio
Last Packager: brettgilio
Votes: 29
Popularity: 1.524069
First Submitted: 2017-10-24 07:26
Last Updated: 2018-09-09 21:00

Latest Comments

« First ‹ Previous 1 2 3 4

Chais commented on 2018-02-20 23:31

@SunDoctor: It builds without issues in a clean chroot, so I'm not sure where your problem comes from.

SunDoctor commented on 2018-02-19 11:26

I've got an error while compiling:

System.TypeInitializationException: The type initializer for 'System.Console' threw an exception. ---> System.TypeInitializationException: The type initializer for 'System.ConsoleDriver' threw an exception. ---> System.Exception: Magic number is wrong: 542 at System.TermInfoReader.ReadHeader (System.Byte[] buffer, System.Int32& position) [0x00028] in <a84b655e5e6a49ee96b338ec792f5580>:0 at System.TermInfoReader..ctor (System.String term, System.String filename) [0x0005f] in <a84b655e5e6a49ee96b338ec792f5580>:0 at System.TermInfoDriver..ctor (System.String term) [0x00055] in <a84b655e5e6a49ee96b338ec792f5580>:0 at System.ConsoleDriver.CreateTermInfoDriver (System.String term) [0x00000] in <a84b655e5e6a49ee96b338ec792f5580>:0 at System.ConsoleDriver..cctor () [0x0004d] in <a84b655e5e6a49ee96b338ec792f5580>:0 --- End of inner exception stack trace --- at System.Console.SetupStreams (System.Text.Encoding inputEncoding, System.Text.Encoding outputEncoding) [0x00007] in <a84b655e5e6a49ee96b338ec792f5580>:0 at System.Console..cctor () [0x0008e] in <a84b655e5e6a49ee96b338ec792f5580>:0 --- End of inner exception stack trace --- at NuGet.CommandLine.Program.MainCore (System.String workingDirectory, System.String[] args) [0x00037] in <eca5fa3af2c04391bafa6fe58e194074>:0 at NuGet.CommandLine.Program.Main (System.String[] args) [0x00005] in <eca5fa3af2c04391bafa6fe58e194074>:0 [ERROR] FATAL UNHANDLED EXCEPTION: System.TypeInitializationException: The type initializer for 'System.Console' threw an exception. ---> System.TypeInitializationException: The type initializer for 'System.ConsoleDriver' threw an exception. ---> System.Exception: Magic number is wrong: 542 at System.TermInfoReader.ReadHeader (System.Byte[] buffer, System.Int32& position) [0x00028] in <a84b655e5e6a49ee96b338ec792f5580>:0 at System.TermInfoReader..ctor (System.String term, System.String filename) [0x0005f] in <a84b655e5e6a49ee96b338ec792f5580>:0 at System.TermInfoDriver..ctor (System.String term) [0x00055] in <a84b655e5e6a49ee96b338ec792f5580>:0 at System.ConsoleDriver.CreateTermInfoDriver (System.String term) [0x00000] in <a84b655e5e6a49ee96b338ec792f5580>:0 at System.ConsoleDriver..cctor () [0x0004d] in <a84b655e5e6a49ee96b338ec792f5580>:0 --- End of inner exception stack trace --- at System.Console.SetupStreams (System.Text.Encoding inputEncoding, System.Text.Encoding outputEncoding) [0x00007] in <a84b655e5e6a49ee96b338ec792f5580>:0 at System.Console..cctor () [0x0008e] in <a84b655e5e6a49ee96b338ec792f5580>:0 --- End of inner exception stack trace --- at NuGet.CommandLine.Program.MainCore (System.String workingDirectory, System.String[] args) [0x00037] in <eca5fa3af2c04391bafa6fe58e194074>:0 at NuGet.CommandLine.Program.Main (System.String[] args) [0x00005] in <eca5fa3af2c04391bafa6fe58e194074>:0 make[1]: [Makefile:6: restore] Error 1 make[1]: Leaving directory '/tmp/yaourt-tmp-igor/aur-fsharp/src/fsharp' make: [Makefile:13: all] Error 2 =</eca5fa3af2c04391bafa6fe58e194074></eca5fa3af2c04391bafa6fe58e194074></a84b655e5e6a49ee96b338ec792f5580></a84b655e5e6a49ee96b338ec792f5580></a84b655e5e6a49ee96b338ec792f5580></a84b655e5e6a49ee96b338ec792f5580></a84b655e5e6a49ee96b338ec792f5580></a84b655e5e6a49ee96b338ec792f5580></a84b655e5e6a49ee96b338ec792f5580></eca5fa3af2c04391bafa6fe58e194074></eca5fa3af2c04391bafa6fe58e194074></a84b655e5e6a49ee96b338ec792f5580></a84b655e5e6a49ee96b338ec792f5580></a84b655e5e6a49ee96b338ec792f5580></a84b655e5e6a49ee96b338ec792f5580></a84b655e5e6a49ee96b338ec792f5580></a84b655e5e6a49ee96b338ec792f5580></a84b655e5e6a49ee96b338ec792f5580>

wbthomason commented on 2017-12-04 19:11

@axlemedia Ok, thanks!

poikilos commented on 2017-12-04 16:36

@Chais @wbthomason The command msbuild (a script in /usr/bin which calls MSBuild.dll), is provided by msbuild-stable in AUR now (msbuild.exe is not), and msbuild-bin (which contains msbuild.exe) is flagged outdated in AUR. Please take note.

Chais commented on 2017-11-11 13:53

@m3thodic
Current: source=("git+https://github.com/fsharp/fsharp/#commit=$_commit")
Yours: source=("git+https://github.com/fsharp/fsharp/#commit=$_commit")
I fail to see the difference. Also what do you think I built the package with when testing?

m3thodic commented on 2017-11-11 04:45

@Chais can you please update the source line to:
source=("git+https://github.com/fsharp/fsharp/#commit=$_commit")

This allows makepkg to build the package.

Thanks.

wbthomason commented on 2017-11-09 22:52

Thought it isn't ideal, there is msbuild-bin in the AUR. Would adding that as a dependency permit use of 4.1.29?

Chais commented on 2017-11-09 22:18

4.1.23 is the last version that builds with xbuild. 4.1.24 switched to msbuild, which for some reason isn't available in Arch's mono 5.0, although it should be according to the mono folks.

MarcinWieczorek commented on 2017-11-09 21:23

Any reason why is this not 4.1.29? Well I remember I couldn't build it anyway...

Win8Error commented on 2017-10-30 22:00

Package can not be compiled

Build started 30.10.2017 22:58:34.
__________________________________________________
src/fsharp/FSharp.Core/FSharp.Core.fsproj: error : /home/joel/fsharp/src/fsharp/src/fsharp/FSharp.Core/FSharp.Core.fsproj: /home/joel/fsharp/src/fsharp/src/fsharp/FSharp.Core/../../FSharpSource.targets: Project file could not be imported, it was being imported by /home/joel/fsharp/src/fsharp/src/fsharp/FSharp.Core/FSharp.Core.fsproj: Input string was not in a correct format.
Build FAILED.
Errors:

src/fsharp/FSharp.Core/FSharp.Core.fsproj: error : /home/joel/fsharp/src/fsharp/src/fsharp/FSharp.Core/FSharp.Core.fsproj: /home/joel/fsharp/src/fsharp/src/fsharp/FSharp.Core/../../FSharpSource.targets: Project file could not be imported, it was being imported by /home/joel/fsharp/src/fsharp/src/fsharp/FSharp.Core/FSharp.Core.fsproj: Input string was not in a correct format.

0 Warning(s)
1 Error(s)

Time Elapsed 00:00:00.0873770
make[1]: *** [Makefile:32: build] Fehler 1
make[1]: Verzeichnis „/home/joel/fsharp/src/fsharp“ wird verlassen
make: *** [Makefile:14: all] Fehler 2
==> FEHLER: Ein Fehler geschah in build().
Breche ab...