Package Details: gazebo 10.2.0-2

Git Clone URL: https://aur.archlinux.org/gazebo.git (read-only, click to copy)
Package Base: gazebo
Description: A multi-robot simulator for outdoor environments
Upstream URL: http://gazebosim.org/
Licenses: Apache
Submitter: None
Maintainer: billypilgrim
Last Packager: billypilgrim
Votes: 28
Popularity: 0.192198
First Submitted: 2008-10-18 22:59
Last Updated: 2020-03-18 18:26

Dependencies (32)

Sources (2)

Pinned Comments

billypilgrim commented on 2020-03-18 18:27

I've updated this package to the latest 10.x series version, but v11.0.0 is currently not working (the dependencies won't build) because of this issue: https://github.com/swig/swig/issues/1689

A fix for the swig package is on the way and after that's in the main repos I'll bump this package to v11.

Latest Comments

« First ‹ Previous ... 6 7 8 9 10 11 12 13 14 15 16 ... Next › Last »

nodabba commented on 2018-08-14 17:51

I was able to compile and run gazebo with the following modified ogre-1.11.patch: https://gist.github.com/n0dabba/bd586b466da068e2eb9a24c003d507c1 Current patch was lacking of one more fix (see https://bitbucket.org/osrf/gazebo/issues/2475/gazebo9-compile-error-with-ogre111 for more info). Thanks @greboide for link.

nicolino commented on 2018-08-12 17:55

Hi,

Last version of gazebo fixes newer boost dependencies and, supposedly, OGRE.

However, whenever I try to run it, the following happens:

[Err] [main.cc:34] Ogre Error:ItemIdentityException: Can not find codec for 'png' image format. Supported formats are: dds ktx pkm. in Codec::getCodec at /build/ogre/src/ogre-1.11.1/OgreMain/src/OgreCodec.cpp (line 66)

I have checked on google and the same problem is reported here:

https://forums.ogre3d.org/viewtopic.php?t=94306

It says to modify a plugins.cfg as new version of Ogre needs explicit activation of the png images plugin.

Although I found the plugins.cfg file for the general Ogre installation, I could not find the gazebo one.

Any clues?

Best Regards.

nicolino commented on 2018-08-05 13:46

Hi,

for the same problems with Ogre and boost, also the installation of ros-melodic-gazebo-ros goes nuts.

@LazyLucretia

I have installed and test-run (just roscore for now) ROS-MELODIC AND GAZEBO by keeping the old downgrades

Ogre: ogre-1.10.10-3-x86_64.pkg.tar.xz boost: boost-1.66.0-3-x86_64.pkg.tar.xz boost-libs: boost-libs-1.66.0-3-x86_64.pkg.tar.xz

and also downgrading

gdbm to gdbm-1.14.1-1-x86_64.pkg.tar.xz

@jlecoeur

Yep, libreoffice needs newer boost.

Best regards

1CatchMe1 commented on 2018-08-01 20:51

@greboide It does compile, but doesn't run!!

greboide commented on 2018-07-22 17:22

i was able to compile with this PKGBUILD: https://gist.github.com/greboide/2949ae90ab6a23a9c541086439f1533a ive used patchs from here: https://bitbucket.org/osrf/gazebo/issues/2475/gazebo9-compile-error-with-ogre111 but i did not tested it to see if it is working...

1CatchMe1 commented on 2018-07-14 14:44

@LazyLucretia comment "patch -Np2 -i "${srcdir}/ogre-1.10.patch" in PKGBUILD

jlecoeur commented on 2018-07-14 10:46

Same here, I have downgraded boost as indicated by @nicolino as a temporary fix. An annoying side effect is that libre office now crashes on startup.

A proper fix would be really appreciated!

braineniac commented on 2018-07-14 10:21

@LazyLucretia I am having the same issue. Still waiting for a proper fix

LazyLucretia commented on 2018-07-13 19:33

@rochus I tried your patch. Unfortunately, it did not work for me. I get this error when I try to build:

In file included from /home/umut/.manually_installed_pkgs/gazebo/src/gazebo-9.0.0/gazebo/rendering/MovableText.hh:27,
                 from /home/umut/.manually_installed_pkgs/gazebo/src/gazebo-9.0.0/gazebo/rendering/ApplyWrenchVisual.cc:24:
/home/umut/.manually_installed_pkgs/gazebo/src/gazebo-9.0.0/gazebo/rendering/ogre_gazebo.h:34:10: fatal error: OGRE/OgreWindowEventUtilities.h: No such file or directory
 #include <OGRE/OgreWindowEventUtilities.h>
          ^~~~~~~~~~~~~~~~~~~~~~~~~~~~~~~~~
compilation terminated.
make[2]: *** [gazebo/rendering/CMakeFiles/gazebo_rendering.dir/build.make:63: gazebo/rendering/CMakeFiles/gazebo_rendering.dir/ApplyWrenchVisual.cc.o] Error 1
make[1]: *** [CMakeFiles/Makefile2:2501: gazebo/rendering/CMakeFiles/gazebo_rendering.dir/all] Error 2
make: *** [Makefile:141: all] Error 2
==> ERROR: A failure occurred in build().
    Aborting...

rochus commented on 2018-07-03 06:35

@LazyLucretia, the compilation errors are due to boost 1.67. Upstream gazebo already fixed these issues in their master branch. You can find my patch in which I backported the relevant changes for the AUR package here: https://gist.github.com/rochus/82ab183cbbebe91ca427e29a28fa3b77