Package Details: gimp-painter-git 20151013.g87851f6-1

Git Clone URL: https://aur.archlinux.org/gimp-painter-git.git (read-only)
Package Base: gimp-painter-git
Description: Fork of GIMP aiming to add drawing and painting features to GIMP. Git version
Upstream URL: http://www.gimp.org
Licenses: GPL, LGPL
Conflicts: gimp, gimp-painter
Provides: gimp=2.8
Submitter: maz-1
Maintainer: maz-1
Last Packager: maz-1
Votes: 1
Popularity: 0.000020
First Submitted: 2015-10-04 07:06
Last Updated: 2015-10-30 08:44

Dependencies (38)

Required by (148)

Sources (4)

Latest Comments

severoraz commented on 2017-01-27 19:10

I get the same error as felipe.facundes. Could this be fixed?

felipe.facundes commented on 2016-11-27 01:43

patching file autogen.sh
Reversed (or previously applied) patch detected! Assume -R? [n]
Apply anyway? [n]
Skipping patch.
1 out of 1 hunk ignored -- saving rejects to file autogen.sh.rej
==> ERROR: Uma falha ocorreu em prepare().


---------------------------------------------
This happens, regardless if I answer yes or not
--------------------------------------
This is true regardless of whether I answer yes or no.

y or n

Daedalus24 commented on 2015-10-20 08:37

There is an error when compiling

...
CCLD file-psp
In file included from file-ps.c:90:0:
/usr/include/ghostscript/ierrors.h:22:22: fatal error: gserrors.h: No such file or directory
compilation terminated.
Makefile:5167: recipe for target 'file-ps.o' failed
make[3]: *** [file-ps.o] Error 1
make[3]: *** Waiting for unfinished jobs....
make[3]: Leaving directory '/tmp/yaourt-tmp-unicornis65/aur-gimp-painter-git/src/gimp-painter/plug-ins/common'
Makefile:639: recipe for target 'all-recursive' failed
make[2]: *** [all-recursive] Error 1
make[2]: Leaving directory '/tmp/yaourt-tmp-unicornis65/aur-gimp-painter-git/src/gimp-painter/plug-ins'
Makefile:757: recipe for target 'all-recursive' failed
make[1]: *** [all-recursive] Error 1
make[1]: Leaving directory '/tmp/yaourt-tmp-unicornis65/aur-gimp-painter-git/src/gimp-painter'
Makefile:660: recipe for target 'all' failed