Package Details: git-cola 3.3-1

Git Clone URL: https://aur.archlinux.org/git-cola.git (read-only)
Package Base: git-cola
Description: A powerful GUI for Git
Upstream URL: http://git-cola.github.com/
Keywords: git
Licenses: GPL
Submitter: tdy
Maintainer: nobody44
Last Packager: nobody44
Votes: 205
Popularity: 0.664086
First Submitted: 2008-12-05 14:38
Last Updated: 2019-02-10 10:21

Dependencies (11)

Required by (0)

Sources (1)

Latest Comments

« First ‹ Previous 1 2 3 4 5 6 7 Next › Last »

Azd325 commented on 2015-02-04 20:01

That was happen where I was installing the package with inside of a virtualenv

nobody44 commented on 2015-01-26 14:18

Did you remove the python-sip package? It is a dependency of python-pyqt4, basically you shouldn't be able to remove it...

Azd325 commented on 2015-01-26 12:45

Traceback (most recent call last):
File "/usr/bin/git-cola", line 55, in <module>
from cola.app import add_common_arguments
File "/usr/share/git-cola/lib/cola/app.py", line 20, in <module>
import sip
ImportError: No module named sip

That was happen where I was installing the package with inside of a virtualenv

Azd325 commented on 2015-01-26 12:15

Traceback (most recent call last):
File "/usr/bin/git-cola", line 55, in <module>
from cola.app import add_common_arguments
File "/usr/share/git-cola/lib/cola/app.py", line 20, in <module>
import sip
ImportError: No module named sip

andrewchen commented on 2014-12-13 01:09

Version 2.0.8 compiles, please update.

nobody44 commented on 2014-10-03 16:05

Right now there is a bug in the git-cola code that prevents the package from compiling. I fixed it and created a pull-request on github... I will release the new version as soon as this small bug fix has been merged.

liviucmg commented on 2014-08-23 21:20

Can confirm that the fix posted by @pablovilas works, but only after a reboot.

leledumbo commented on 2014-08-19 04:53

Got similar error as pablovilas, however his locale-gen workaround does't work for me. Logs:

# Sphinx version: 1.2.2
# Python version: 3.4.1
# Docutils version: 0.12 release
# Jinja2 version: 2.7.3
# Loaded extensions:
# sphinx.ext.doctest from /usr/lib/python3.4/site-packages/sphinx/ext/doctest.py
# sphinx.ext.autodoc from /usr/lib/python3.4/site-packages/sphinx/ext/autodoc.py
# sphinx.ext.oldcmarkup from /usr/lib/python3.4/site-packages/sphinx/ext/oldcmarkup.py
# sphinx.ext.coverage from /usr/lib/python3.4/site-packages/sphinx/ext/coverage.py
# sphinx.ext.todo from /usr/lib/python3.4/site-packages/sphinx/ext/todo.py
# sphinx.ext.intersphinx from /usr/lib/python3.4/site-packages/sphinx/ext/intersphinx.py
# sphinxtogithub from /tmp/yaourt-tmp-leledumbo/aur-git-cola/src/git-cola-2.0.5/extras/sphinxtogithub/__init__.py
Traceback (most recent call last):
File "/usr/lib/python3.4/site-packages/sphinx/cmdline.py", line 254, in main
app.build(force_all, filenames)
File "/usr/lib/python3.4/site-packages/sphinx/application.py", line 221, in build
self.emit('build-finished', None)
File "/usr/lib/python3.4/site-packages/sphinx/application.py", line 400, in emit
results.append(callback(self, *args))
File "/tmp/yaourt-tmp-leledumbo/aur-git-cola/src/git-cola-2.0.5/extras/sphinxtogithub/sphinxtogithub.py", line 315, in sphinx_extension
layout.process()
File "/tmp/yaourt-tmp-leledumbo/aur-git-cola/src/git-cola-2.0.5/extras/sphinxtogithub/sphinxtogithub.py", line 174, in process
handler.process()
File "/tmp/yaourt-tmp-leledumbo/aur-git-cola/src/git-cola-2.0.5/extras/sphinxtogithub/sphinxtogithub.py", line 52, in process
text = self.opener(self.name).read()
File "/usr/lib/python3.4/encodings/ascii.py", line 26, in decode
return codecs.ascii_decode(input, self.errors)[0]
UnicodeDecodeError: 'ascii' codec can't decode byte 0xc4 in position 3671: ordinal not in range(128)

carstene1ns commented on 2014-08-18 08:40

@zottelef: 'qgis'[1] package is the offender, it bundles the python2 version of pygments and somehow gets in the way. There is already a discussion at the package page. Try removing it before building and it should work.

[1]: https://aur.archlinux.org/packages/qgis/

zottelef commented on 2014-08-18 07:41

While building git-cola I get the following error

sphinx-build -b html -d _build/doctrees . _build/html
Traceback (most recent call last):
File "/usr/bin/sphinx-build", line 9, in <module>
load_entry_point('Sphinx==1.2.2', 'console_scripts', 'sphinx-build')()
File "/usr/lib/python3.4/site-packages/sphinx/__init__.py", line 49, in main
from sphinx import cmdline
File "/usr/lib/python3.4/site-packages/sphinx/cmdline.py", line 22, in <module>
from sphinx.application import Sphinx
File "/usr/lib/python3.4/site-packages/sphinx/application.py", line 22, in <module>
from docutils.parsers.rst import convert_directive_function, \
File "/usr/lib/python3.4/site-packages/docutils/parsers/rst/__init__.py", line 75, in <module>
from docutils.parsers.rst import states
File "/usr/lib/python3.4/site-packages/docutils/parsers/rst/states.py", line 116, in <module>
from docutils.parsers.rst import directives, languages, tableparser, roles
File "/usr/lib/python3.4/site-packages/docutils/parsers/rst/roles.py", line 78, in <module>
from docutils.utils.code_analyzer import Lexer, LexerError
File "/usr/lib/python3.4/site-packages/docutils/utils/code_analyzer.py", line 12, in <module>
import pygments
File "/usr/share/qgis/python/pygments/__init__.py", line 46
except TypeError, err:
^
SyntaxError: invalid syntax
Makefile:44: recipe for target 'html' failed
make[1]: *** [html] Error 1