Package Details: gnome-shell-pomodoro 0.18.0-2

Git Clone URL: https://aur.archlinux.org/gnome-shell-pomodoro.git (read-only, click to copy)
Package Base: gnome-shell-pomodoro
Description: A time management utility for GNOME based on the pomodoro technique
Upstream URL: https://github.com/gnome-pomodoro/gnome-pomodoro
Keywords: gnome management pomodoro time
Licenses: GPL3
Submitter: haaja
Maintainer: liamtimms
Last Packager: liamtimms
Votes: 100
Popularity: 1.69
First Submitted: 2014-01-11 17:23
Last Updated: 2021-01-22 23:44

Latest Comments

1 2 3 4 5 6 ... Next › Last »

amatas commented on 2021-03-08 09:07

I get these build errors if the packages at the bottom are missing. Perhaps they might be added to the makedepens:

Errors:

autoreconf: './config.sub' is updated autoreconf: './config.guess' is updated autoreconf: Leaving directory '.' ./configure: line 2827: syntax error near unexpected token git-directory' ./configure: line 2827:AX_IS_RELEASE(git-directory)'

configure.ac:73: error: macro GOBJECT_INTROSPECTION_REQUIRE is not defined; is a m4 file missing? /usr/share/aclocal/ax_require_defined.m4:35: AX_REQUIRE_DEFINED is expanded from... configure.ac:73: the top level autom4te: error: /usr/bin/m4 failed with exit status: 1 aclocal: error: autom4te failed with exit status: 1

configure.ac:79: error: macro VAPIGEN_CHECK is not defined; is a m4 file missing? /usr/share/aclocal/ax_require_defined.m4:35: AX_REQUIRE_DEFINED is expanded from... configure.ac:79: the top level autom4te: error: /usr/bin/m4 failed with exit status: 1 aclocal: error: autom4te failed with exit status: 1

Packages needed:

vala, gobject-introspection, autoconf-archive

liamtimms commented on 2021-01-29 00:11

@reedlaw automake is part of base-devel. These packages are a prerequisite for using the AUR https://wiki.archlinux.org/index.php/Arch_User_Repository#Getting_started and thus not included in PKGBUILD makedepends (see the note here https://wiki.archlinux.org/index.php/PKGBUILD#makedepends).

reedlaw commented on 2021-01-28 17:14

Package is missing a dependency:

==> Starting prepare()... ./autogen.sh: line 16: aclocal: command not found

Should have 'automake' in the depends list.

realOtto commented on 2021-01-27 19:04

@liamtimms Thanks for your help and sorry for the confusion. You were right, the problem was an old cached version in pamac, using yay solved it. The sha256sum has no issues. I'm still learning and today i learned something, thank you ;-)

liamtimms commented on 2021-01-27 00:13

@realOtto can you verify that this is happening in a clean build with makepkg? It is working on my end so potentially you may be hitting an issue with a cached version from an AUR helper. You can even check the sha256 checksum manually by grabbing a the latest release from https://github.com/gnome-pomodoro/gnome-pomodoro/releases and running sha256sum gnome-pomodoro-0.18.0.tar.gz yourself.

realOtto commented on 2021-01-26 22:18

Hi liamtimms, i also have a checksum problem, seems there is still something wrong with the sha256.

Here is my output: ... -> Found gnome-shell-pomodoro-0.18.0.tar.gz ==> Validating source files with sha256sums... gnome-shell-pomodoro-0.18.0.tar.gz ... FAILED ==> ERROR: One or more files did not pass the validity check! Failed to build gnome-shell-pomodoro

liamtimms commented on 2021-01-22 23:21

Hi @Geeko, what problem are you having with the checksum? It is passing on my machine.

edit: turns out it was passing with the old checksum if you downloaded from the new URL. I updated the URL for the new source repo and it should be working now.

Geeko commented on 2021-01-22 16:44

the checksum doesn't match

liamtimms commented on 2021-01-12 14:23

@g33k thanks for the heads up.

g33k commented on 2021-01-12 02:22

Hi, the source repository is changed to https://github.com/gnome-pomodoro/gnome-pomodoro