Package Details: gnome-shell-pomodoro 1.1.0-1

Git Clone URL: https://aur.archlinux.org/gnome-shell-pomodoro.git (read-only, click to copy)
Package Base: gnome-shell-pomodoro
Description: A time management utility for GNOME based on the pomodoro technique
Upstream URL: https://github.com/gnome-pomodoro/gnome-pomodoro
Keywords: gnome management pomodoro time
Licenses: GPL3
Submitter: haaja
Maintainer: liamtimms
Last Packager: liamtimms
Votes: 117
Popularity: 0.013010
First Submitted: 2014-01-11 17:23 (UTC)
Last Updated: 2026-04-17 20:20 (UTC)

Pinned Comments

liamtimms commented on 2022-04-13 22:50 (UTC) (edited on 2023-01-23 17:02 (UTC) by liamtimms)

recommendation: disable screen notifications. This part of the extension regularly gets borked, and it seems like that's happening again on 42.

edit: haven't tested on latest release and GNOME 43 but leaving this here in case it comes up again.

Latest Comments

« First ‹ Previous 1 2 3 4 5 6 7 8 .. 13 Next › Last »

gj545rndmu commented on 2021-10-19 12:20 (UTC)

Not only the makedepends should be updated, but also depends (see https://aur.archlinux.org/cgit/aur.git/commit/?h=gnome-pomodoro-git&id=dc82bc341d63ccf3afd2b4213fc81c2e36c1bd48).

peippo commented on 2021-10-19 10:03 (UTC)

Could you include meson in the makedepends()? Thanks!

gj545rndmu commented on 2021-09-26 11:33 (UTC)

@liamtimms version 0.20.0 is available. Just that you know, now you need to build it with meson.

vmartini commented on 2021-04-28 17:02 (UTC)

Thank you so much! That fixed it, I used this app before in Fedora and I didn't need to restart GNOME, but it is a very minor issue.

liamtimms commented on 2021-04-28 16:47 (UTC) (edited on 2021-04-28 16:47 (UTC) by liamtimms)

@vmartini have you restarted GNOME shell since installing and enabling it? This isn't needed with most extensions but seems to be needed with this one. I'd try rebooting your machine first.

vmartini commented on 2021-04-28 16:45 (UTC)

Hi, I just installed this package and the app freezes when I open it. I ran it from the terminal to see if there was any error output but there are no error messages. Any ideas of what could be the problem? I'm using GNOME 40.

liamtimms commented on 2021-03-26 01:05 (UTC) (edited on 2021-04-12 01:43 (UTC) by liamtimms)

With GNOME 40 hitting any day now (currently in staging), expect some problems with this package. I will update it as soon as upstream releases a new version but it may get borked for a little while. This is common with new GNOME releases and this particular release has more changes than usual. First week or so could be a little rough if you use a lot of extensions.

edit: it's been updated but there's a mistake upstream in 40 compatibility for this release. Expect a new release soon addressing this.

edit 2: rolled out to GNOME 40.

liamtimms commented on 2021-03-10 00:09 (UTC)

@amatas, those are all included in dependencies already.

amatas commented on 2021-03-08 09:07 (UTC)

I get these build errors if the packages at the bottom are missing. Perhaps they might be added to the makedepens:

Errors:

autoreconf: './config.sub' is updated autoreconf: './config.guess' is updated autoreconf: Leaving directory '.' ./configure: line 2827: syntax error near unexpected token git-directory' ./configure: line 2827:AX_IS_RELEASE(git-directory)'

configure.ac:73: error: macro GOBJECT_INTROSPECTION_REQUIRE is not defined; is a m4 file missing? /usr/share/aclocal/ax_require_defined.m4:35: AX_REQUIRE_DEFINED is expanded from... configure.ac:73: the top level autom4te: error: /usr/bin/m4 failed with exit status: 1 aclocal: error: autom4te failed with exit status: 1

configure.ac:79: error: macro VAPIGEN_CHECK is not defined; is a m4 file missing? /usr/share/aclocal/ax_require_defined.m4:35: AX_REQUIRE_DEFINED is expanded from... configure.ac:79: the top level autom4te: error: /usr/bin/m4 failed with exit status: 1 aclocal: error: autom4te failed with exit status: 1

Packages needed:

vala, gobject-introspection, autoconf-archive