Package Details: gnunet-fuse 0.11.0-1

Git Clone URL: https://aur.archlinux.org/gnunet-fuse.git (read-only)
Package Base: gnunet-fuse
Description: Read-only mounting of GNUnet directories as file systems using FUSE
Upstream URL: https://gnunet.org/
Keywords: Anonymity GNUnet Interent P2P
Licenses: GPL
Conflicts: gnunet-fuse-git
Submitter: grufo
Maintainer: grufo
Last Packager: grufo
Votes: 0
Popularity: 0.000000
First Submitted: 2018-03-16 13:00
Last Updated: 2019-03-03 12:51

Dependencies (2)

Required by (0)

Sources (1)

Latest Comments

dreieck commented on 2018-11-28 22:21

Fails to build:

[...]
gcc  -fno-strict-aliasing -Wall -g -O2     -o gnunet-fuse gnunet_fuse-gnunet-fuse.o gnunet_fuse-gfs_download.o gnunet_fuse-mutex.o gnunet_fuse-readdir.o gnunet_fuse-read.o gnunet_fuse-open.o gnunet_fuse-getattr.o -lgnunetutil -lfuse -lgnunetfs  -lgnunetutil  -lpthread 
/sbin/ld: gnunet_fuse-gnunet-fuse.o: in function `main':
/tmp/yaourt-tmp-felics/aur-gnunet-fuse/src/gnunet-fuse-0.11.0pre66/src/fuse/gnunet-fuse.c:500: undefined reference to `GNUNET_GETOPT_option_string'
/sbin/ld: /tmp/yaourt-tmp-felics/aur-gnunet-fuse/src/gnunet-fuse-0.11.0pre66/src/fuse/gnunet-fuse.c:505: undefined reference to `GNUNET_GETOPT_option_string'
/sbin/ld: /tmp/yaourt-tmp-felics/aur-gnunet-fuse/src/gnunet-fuse-0.11.0pre66/src/fuse/gnunet-fuse.c:510: undefined reference to `GNUNET_GETOPT_option_flag'
/sbin/ld: gnunet_fuse-gfs_download.o: in function `download_task':
/tmp/yaourt-tmp-felics/aur-gnunet-fuse/src/gnunet-fuse-0.11.0pre66/src/fuse/gfs_download.c:189: undefined reference to `GNUNET_SCHEDULER_add_shutdown'
collect2: error: ld returned 1 exit status
make[4]: *** [Makefile:454: gnunet-fuse] Error 1
make[4]: Leaving directory '/tmp/yaourt-tmp-felics/aur-gnunet-fuse/src/gnunet-fuse-0.11.0pre66/src/fuse'
make[3]: *** [Makefile:589: all-recursive] Error 1
make[3]: Leaving directory '/tmp/yaourt-tmp-felics/aur-gnunet-fuse/src/gnunet-fuse-0.11.0pre66/src/fuse'
make[2]: *** [Makefile:350: all-recursive] Error 1
make[2]: Leaving directory '/tmp/yaourt-tmp-felics/aur-gnunet-fuse/src/gnunet-fuse-0.11.0pre66/src'
make[1]: *** [Makefile:398: all-recursive] Error 1
make[1]: Leaving directory '/tmp/yaourt-tmp-felics/aur-gnunet-fuse/src/gnunet-fuse-0.11.0pre66'
make: *** [Makefile:339: all] Error 2
==> ERROR: A failure occurred in build().
    Aborting...