Package Details: google-gadgets-gtk-svn 1292-2

Git Clone URL: (read-only)
Package Base: google-gadgets-gtk-svn
Description: Google Gadgets for linux (svn version, gtk toolkit)
Upstream URL:
Licenses: Apache
Provides: google-gadgets
Submitter: amuchamu
Maintainer: jorge_barroso
Last Packager: jorge_barroso
Votes: 11
Popularity: 0.000000
First Submitted: 2008-06-05 11:38
Last Updated: 2015-06-15 19:26

Latest Comments

rrhaskin commented on 2015-11-13 02:24

Still has the same problem described by mrbit on 2013-05-16 11:34, Same exact error so I wont waste bits by posting it again. I've tried this on two seperate computers with the same result. I don't know how to fix it, but I would sure like to play with the application

jorge_barroso commented on 2014-07-14 16:42

I've seen it, but i don't know how to patch it, as I've seen on google it should be a problem with new gui compilers (another program had a similar error but with modern QT on an old QT program)
Someone knows how to patch it? the problem was solved removing a couple of code lines which limited the QT versions usable

mrbit commented on 2013-05-16 11:34

not compila..
unzip_la-zip.Tpo -c zip.c -fPIC -DPIC -o .libs/libunzip_la-zip.o
zip.c: In function 'zipOpenNewFileInZip3':
zip.c:884:28: error: assignment from incompatible pointer type [-Werror]
zi->ci.pcrc_32_tab = get_crc_table();
unzip.c: In function 'unzOpenCurrentFile3':
unzip.c:1176:24: error: assignment from incompatible pointer type [-Werror]
s->pcrc_32_tab = get_crc_table();
cc1: all warnings being treated as errors
cc1: all warnings being treated as errors
make[3]: *** [libunzip_la-zip.lo] Errore 1
make[3]: *** Attesa dei processi non terminati....
make[3]: *** [libunzip_la-unzip.lo] Errore 1
make[3]: Leaving directory `/tmp/yaourt-tmp-mrbit/aur-google-gadgets-gtk-svn/src/google-gadgets-build/third_party/unzip'
make[2]: *** [all-recursive] Errore 1
make[2]: Leaving directory `/tmp/yaourt-tmp-mrbit/aur-google-gadgets-gtk-svn/src/google-gadgets-build/third_party'
make[1]: *** [all-recursive] Errore 1
make[1]: Leaving directory `/tmp/yaourt-tmp-mrbit/aur-google-gadgets-gtk-svn/src/google-gadgets-build'
make: *** [all] Errore 2

jorge_barroso commented on 2013-02-26 17:23

Adopted, uploading soon :)

sistematico commented on 2012-01-12 14:03

For me under Arch 32:

killajoe commented on 2010-07-30 15:58

For me under arch64 building Fails: