Package Details: gpwsafe 0.21.5-1

Git Clone URL: https://aur.archlinux.org/gpwsafe.git (read-only)
Package Base: gpwsafe
Description: A commandline program for managing encrypted password databases
Upstream URL: https://github.com/sakhnik/gpwsafe
Licenses: GPL
Submitter: sakhnik
Maintainer: sakhnik
Last Packager: sakhnik
Votes: 6
Popularity: 0.000066
First Submitted: 2012-01-28 17:52
Last Updated: 2017-01-08 07:52

Latest Comments

sakhnik commented on 2016-10-27 08:47

Version 0.21.3:

* Fix build due to changes in gtest

sakhnik commented on 2015-10-22 09:41

Version 0.21.0:

* Fix command line options with boost-1.59 (build failed due to failing tests)

sakhnik commented on 2015-09-17 03:33

That's weird. python-pexpect is listed among makedepend. Could you please try to reinstall python-pexpect on your system?

UPD: There's a chance that python is aliased to python2 in your shell. Thus, python2-pexpect may be not required by the build system.

pschmitt commented on 2015-09-16 13:29

Some test do not pass:

Test project /tmp/yaourt-tmp-pschmitt/aur-gpwsafe/src/gpwsafe-0.20.3/BUILD
Start 1: KeyStretchTest
1/5 Test #1: KeyStretchTest ................... Passed 0.00 sec
Start 2: File3Test
2/5 Test #2: File3Test ........................ Passed 0.01 sec
Start 3: DatabaseTest
3/5 Test #3: DatabaseTest ..................... Passed 0.02 sec
Start 4: EntryTest
4/5 Test #4: EntryTest ........................ Passed 0.00 sec
Start 5: functional.generic
5/5 Test #5: functional.generic ...............***Failed 0.01 sec
Traceback (most recent call last):
File "/tmp/yaourt-tmp-pschmitt/aur-gpwsafe/src/gpwsafe-0.20.3/test/generic_test.py", line 3, in <module>
import pexpect, sys, os
ImportError: No module named pexpect


80% tests passed, 1 tests failed out of 5

Total Test time (real) = 0.05 sec

The following tests FAILED:
5 - functional.generic (Failed)
Errors while running CTest
CMakeFiles/check.dir/build.make:57: recipe for target 'CMakeFiles/check' failed
make[3]: *** [CMakeFiles/check] Error 8
CMakeFiles/Makefile2:963: recipe for target 'CMakeFiles/check.dir/all' failed
make[2]: *** [CMakeFiles/check.dir/all] Error 2
CMakeFiles/Makefile2:970: recipe for target 'CMakeFiles/check.dir/rule' failed
make[1]: *** [CMakeFiles/check.dir/rule] Error 2
Makefile:537: recipe for target 'check' failed
make: *** [check] Error 2
==> ERROR: A failure occurred in build().
Aborting..

sakhnik commented on 2014-12-16 05:31

Version 0.20.1:

* Fix password autogeneration when adding new entry
* Fix typos in the manual page

sakhnik commented on 2014-12-03 21:11

Version 0.20.0:

* Introduce TUI to pick up an entry for listing, editing and deleting.

sakhnik commented on 2014-05-19 19:28

Version 0.11.0:

* Using boost::filesystem for better symlink handling
* Updated Ukrainian translation
* Implemented --delete

sakhnik commented on 2014-03-27 20:19

The version 0.10.0:

* Build with cmake
* Google test for unit tests

sakhnik commented on 2014-03-24 19:54

The version 0.9.4:

* Ukrainian translation
* X selection (default PRIMARY + CLIPBOARD)

sakhnik commented on 2014-03-15 19:44

The version 0.9.0:

* Tilde expansion in file name
* Follow symlinks to make database backup
* Print details of a single entry match

All comments