Package Details: great-little-radio-player 1.4.7-2

Git Clone URL: https://aur.archlinux.org/great-little-radio-player.git (read-only)
Package Base: great-little-radio-player
Description: A robust internet radio station streamer
Upstream URL: https://sites.google.com/site/glrpgreatlittleradioplayer
Licenses: GPL3
Submitter: TheKillerremijn
Maintainer: InfernoZeus
Last Packager: InfernoZeus
Votes: 6
Popularity: 0.000001
First Submitted: 2015-08-25 22:24
Last Updated: 2017-05-15 14:19

Latest Comments

dreieck commented on 2018-03-26 09:59

sha1 checksum verification fails:

==> Validating source files with sha1sums...
    greatlittleradioplayer_1.4.7.tar.gz ... FAILED

test0 commented on 2017-08-05 09:11

Are there object files in the source tarball?
I had to remove *.o to get past -fPIC compilation error.

InfernoZeus commented on 2017-02-28 11:18

This package needs to be updated to depend on "phonon-qt4" and "phonon-qt4-gstreamer" (optional).

silvernode commented on 2015-09-29 16:09

If anyone is using plasma-5, keep in mind that the system tray icon will not show up preventing this application from functioning. You must get the following package(s):

--------------------------------
sni-qt -for qt4 applications
ibappindicator-gtk2 - for gtk2 applications
ibappindicator-gtk3 - for gtk3 applications
--------------------------------

Side Note: I got the radio player to open but it didn't seem to play anything and get stuck on one station which couldn't be switched without closing and re-opening the entire application. Maybe it will work for you, I suspect there is a missing dependency in the PKGBUILD and hope there is a way to get this working.

silvernode commented on 2015-09-29 15:54

[mollusk@archbox ~] $ No systemtrayicon available

martynjy commented on 2015-09-27 16:41

aboutdialog.o: file not recognized: File format not recognized
collect2: error: ld returned 1 exit status
Makefile:121: recipe for target 'GreatLittleRadioPlayer' failed
make: *** [GreatLittleRadioPlayer] Error 1
==> ERROR: A failure occurred in build().
Aborting...

http://pastebin.com/mWvj3Br7

martynjy commented on 2015-09-27 09:58

ERROR: A failure occurred in build().
Aborting...