Package Details: gsettings-qt-bzr 0.1.r69-1

Git Clone URL: https://aur.archlinux.org/gsettings-qt-bzr.git (read-only)
Package Base: gsettings-qt-bzr
Description: Qml bindings for GSettings.
Upstream URL: https://launchpad.net/gsettings-qt
Licenses: GPL
Provides: gsettings-qt
Submitter: Chazza
Maintainer: ricardomv
Last Packager: ricardomv
Votes: 4
Popularity: 0.000000
First Submitted: 2014-04-20 14:11
Last Updated: 2015-06-11 14:42

Required by (0)

Sources (1)

Latest Comments

Manouchehri commented on 2015-03-25 06:37

==> Starting build()...
cd tests/ && ( test -e Makefile || /usr/lib/qt/bin/qmake /tmp/gsettings-qt-bzr/src/gsettings-qt/tests/tests.pro -o Makefile ) && make -f Makefile
cd src/ && ( test -e Makefile.gsettings-qt || /usr/lib/qt/bin/qmake /tmp/gsettings-qt-bzr/src/gsettings-qt/src/gsettings-qt.pro -o Makefile.gsettings-qt ) && make -f Makefile.gsettings-qt
cd GSettings/ && ( test -e Makefile.gsettings-qt || /usr/lib/qt/bin/qmake /tmp/gsettings-qt-bzr/src/gsettings-qt/GSettings/gsettings-qt.pro -o Makefile.gsettings-qt ) && make -f Makefile.gsettings-qt
make[1]: Entering directory '/tmp/gsettings-qt-bzr/src/gsettings-qt/GSettings'
make[1]: Nothing to be done for 'first'.
make[1]: Leaving directory '/tmp/gsettings-qt-bzr/src/gsettings-qt/GSettings'
make[1]: Entering directory '/tmp/gsettings-qt-bzr/src/gsettings-qt/src'
make[1]: Nothing to be done for 'first'.
make[1]: Leaving directory '/tmp/gsettings-qt-bzr/src/gsettings-qt/src'
make[1]: Entering directory '/tmp/gsettings-qt-bzr/src/gsettings-qt/tests'
g++ -Wl,-O1,--sort-common,--as-needed,-z,relro -Wl,-O1 -Wl,-rpath-link,/usr/lib -o test test.o -lQt5Qml -lQt5Network -lQt5Test -lQt5QuickTest -lQt5Widgets -lQt5Gui -lQt5Core -lGLESv2 -lpthread
/usr/lib/libQt5Quick.so.5: undefined reference to `QOpenGLFunctions_3_2_Core::versionProfile()'
/usr/lib/libQt5Quick.so.5: undefined reference to `QOpenGLFunctions_1_0::versionProfile()'
collect2: error: ld returned 1 exit status
Makefile:215: recipe for target 'test' failed
make[1]: *** [test] Error 1
make[1]: Leaving directory '/tmp/gsettings-qt-bzr/src/gsettings-qt/tests'
Makefile:94: recipe for target 'sub-tests-tests-pro-make_first' failed
make: *** [sub-tests-tests-pro-make_first] Error 2
==> ERROR: A failure occurred in build().
Aborting...

metak commented on 2015-02-09 14:51

Hello. 'qt5-declarative' should also be added to depends.

notuxius commented on 2015-01-29 22:08

/usr/bin/makepkg: line 468: bzr: command not found