Package Details: gstreamer0.10-good-plugins 0.10.31-29

Git Clone URL: https://aur.archlinux.org/gstreamer0.10-good.git (read-only, click to copy)
Package Base: gstreamer0.10-good
Description: GStreamer Multimedia Framework Good plugin libraries
Upstream URL: https://github.com/triceratops1/gstreamer0
Licenses: LGPL
Conflicts: gstreamer0.10-aalib, gstreamer0.10-annodex, gstreamer0.10-bad-plugins, gstreamer0.10-cairo, gstreamer0.10-cdio, gstreamer0.10-dv, gstreamer0.10-dv1394, gstreamer0.10-esd, gstreamer0.10-flac, gstreamer0.10-gconf, gstreamer0.10-gdkpixbuf, gstreamer0.10-jpeg, gstreamer0.10-libcaca, gstreamer0.10-libpng, gstreamer0.10-pulse, gstreamer0.10-shout2, gstreamer0.10-soup, gstreamer0.10-speex, gstreamer0.10-taglib, gstreamer0.10-wavpack
Replaces: gstreamer0.10-aalib, gstreamer0.10-annodex, gstreamer0.10-cairo, gstreamer0.10-cdio, gstreamer0.10-dv, gstreamer0.10-dv1394, gstreamer0.10-esd, gstreamer0.10-flac, gstreamer0.10-gconf, gstreamer0.10-gdkpixbuf, gstreamer0.10-jpeg, gstreamer0.10-libcaca, gstreamer0.10-libpng, gstreamer0.10-pulse, gstreamer0.10-shout2, gstreamer0.10-soup, gstreamer0.10-speex, gstreamer0.10-taglib, gstreamer0.10-wavpack
Submitter: yurikoles
Maintainer: kirillnow
Last Packager: kirillnow
Votes: 46
Popularity: 0.058612
First Submitted: 2017-01-26 13:56 (UTC)
Last Updated: 2020-06-14 03:46 (UTC)

Latest Comments

kirillnow commented on 2021-09-17 04:13 (UTC)

Samega7Cattac, it is a bug in gstreamer0.10 package (when compiled with GCC 11). I posted a comment with a fix here https://aur.archlinux.org/packages/gstreamer0.10/

Samega7Cattac commented on 2021-09-15 12:03 (UTC)

In file included from /usr/include/glib-2.0/glib/gthread.h:32,
                 from /usr/include/glib-2.0/glib/gasyncqueue.h:32,
                 from /usr/include/glib-2.0/glib.h:32,
                 from /usr/include/gstreamer-0.10/gst/gst.h:27,
                 from gsttaglibmux.h:24,
                 from gstid3v2mux.h:24,
                 from gstid3v2mux.cc:51:
gstid3v2mux.cc: In function ‘GType gst_id3v2_mux_get_type()’:
/usr/include/glib-2.0/glib/gatomic.h:117:19: error: argument 2 of ‘__atomic_load’ must not be a pointer to a ‘volatile’ type
  117 |     __atomic_load (gapg_temp_atomic, &gapg_temp_newval, __ATOMIC_SEQ_CST); \
      |     ~~~~~~~~~~~~~~^~~~~~~~~~~~~~~~~~~~~~~~~~~~~~~~~~~~~~~~~~~~~~~~~~~~~~~
/usr/include/glib-2.0/glib/gthread.h:260:7: note: in expansion of macro ‘g_atomic_pointer_get’
  260 |     (!g_atomic_pointer_get (location) &&                             \
      |       ^~~~~~~~~~~~~~~~~~~~
/usr/include/gstreamer-0.10/gst/gstutils.h:140:7: note: in expansion of macro ‘g_once_init_enter’
  140 |   if (g_once_init_enter (&gonce_data)) {                                \
      |       ^~~~~~~~~~~~~~~~~
/usr/include/gstreamer-0.10/gst/gstutils.h:180:3: note: in expansion of macro ‘GST_BOILERPLATE_FULL’
  180 |   GST_BOILERPLATE_FULL (type, type_as_function, parent_type, parent_type_macro, \
      |   ^~~~~~~~~~~~~~~~~~~~
gstid3v2mux.cc:76:1: note: in expansion of macro ‘GST_BOILERPLATE’
   76 | GST_BOILERPLATE (GstId3v2Mux, gst_id3v2_mux, GstTagLibMux,
      | ^~~~~~~~~~~~~~~

kirillnow commented on 2020-06-19 00:02 (UTC)

@arch_fram I can't reproduce this error (even with yaourt). Try to build in a clean chroot (see https://wiki.archlinux.org/index.php/DeveloperWiki:Building_in_a_clean_chroot or if you have aurutils: aur sync -rc --noview gstreamer0.10-good)

arch_fram commented on 2020-06-18 20:39 (UTC) (edited on 2020-06-18 20:43 (UTC) by arch_fram)

I can't do the compilation, It's seem like this have a problem with this:

make[3]: out of directory '/tmp/yaourt-tmp-[user-name]/aur-gstreamer0.10-good-plugins/src/gst-plugins-good/gst/spectrum' make -C udp make[3]: enty in directory '/tmp/yaourt-tmp-[user-name]/aur-gstreamer0.10-good-plugins/src/gst-plugins-good/gst/udp' Makefile:598: the call to the fuction 'foreach' was not done: missing ')'. Stop. make[3]: out of directory '/tmp/yaourt-tmp-[user-name]/aur-gstreamer0.10-good-plugins/src/gst-plugins-good/gst/udp' make[2]: [Makefile:868: udp] Error 2 make[2]: out of directory '/tmp/yaourt-tmp-[user-name]/aur-gstreamer0.10-good-plugins/src/gst-plugins-good/gst' make[1]: [Makefile:715: all-recursive] Error 1 make[1]: out of directory '/tmp/yaourt-tmp-[user-name]/aur-gstreamer0.10-good-plugins/src/gst-plugins-good' make: [Makefile:644: all] Error 2 ==> ERROR: An error was producted in build().

kirillnow commented on 2020-06-14 03:50 (UTC)

Fixed compilation error.

gdea73 commented on 2018-02-08 06:35 (UTC)

I recently struggled with getting this to build, along with gstreamer0.10-ffmpeg and gstreamer0.10-bad. They compiled without issue on one system (ThinkPad T440p), but I was getting the GST_VERSION_MAJOR error as described by thebonaestest below on two other (more recently installed) Arch systems.

It turns out the bizarre discrepancy was that I had gstreamer0.10-0.10.36-4-x86_64 installed (from 2014!) on the ThinkPad when I built these packages. The older version of gstreamer (and gstreamer-base) were formerly in the official repositories, and can be found at (https://archive.archlinux.org/packages/g/).

On the two more recent systems, I deliberately installed the old GStreamer from 2014 and was able to install the good, bad, and ffmpeg additions. Then I installed the newest available gstreamer0.10 and gstreamer0.10-base from the AUR only after the former had completed.

(I went through the trouble mainly because I need to use the Processing video library, and it still only supports gstreamer0.10 (officially), though I noticed after it was too late that there was a commit merged into its master branch a couple of months ago adding gst1 support. If anyone encounters this issue, it may be worth pulling down the source for Processing and its video library in order to just use gst1.)

bidulock commented on 2017-12-21 17:32 (UTC)

Need to add python to makedepends to build in chroot.

kirillnow commented on 2017-11-18 09:45 (UTC) (edited on 2017-11-20 12:56 (UTC) by kirillnow)

Fixed

thebonaestest commented on 2017-11-08 04:20 (UTC)

This fails to build for me (Antergos, kernel version 4.13.11-1). It gives a long string of errors starting with: make[3]: Entering directory '/tmp/yaourt-tmp/aur-gstreamer0.10-good/src/gst-plugins-good/gst/videofilter' CC libgstvideofilter_la-plugin.lo In file included from /usr/include/gstreamer-0.10/gst/gst.h:32:0, from plugin.c:24: /usr/include/gstreamer-0.10/gst/gstversion.h:63:27: error: expected declaration specifiers or ‘...’ before ‘(’ token #define GST_VERSION_MAJOR (0) The issue appears to be errors in the source for each plugin - the GST_PLUGIN_DEFINE macro is not called correctly in any of them. I was able to get it to build by fixing the call in each individual plugin. Has anyone else experienced this problem? If so, I can push my changes upstream.

Alad commented on 2017-10-27 18:17 (UTC)

spease, simple - you adopt and fix it.

spease commented on 2017-08-22 03:34 (UTC)

This is still broken and it's apparently been a few months. How can the situation be rectified?

commented on 2017-05-27 18:39 (UTC)

Is there an easy way to change this in an active database of installed packages or will I need to uninstall the whole thing and all its dependencies just to change the PKGBUILD and reinstall?

dreieck commented on 2017-05-16 11:59 (UTC)

new upstream version of package 'extra/libsoup' does not provide anymore 'libsoup-gnome'. Consider changing the dependency 'libsoup-gnome' to 'libsoup'.

commented on 2017-05-13 21:11 (UTC)

Still no fire-and-forget command for this libsoup thing? Currently, I don't have time to figure out whats going on.

krnl0138 commented on 2017-05-12 13:23 (UTC)

@hamelg just did pacman -Rdd the whole gstreamer & libsoup and it works fine after reinstall, idk what it was w/ compilator, thanks for help

hamelg commented on 2017-05-11 19:23 (UTC)

Here, it compiles fine with just the libsoup fix. Where the gcc option [-Wunused-function] comes from ? from your environment ?

krnl0138 commented on 2017-05-10 10:24 (UTC) (edited on 2017-05-10 10:26 (UTC) by krnl0138)

Cannot install pkg after those errors on building by pacaur (clean installation from repo): https://pastebin.com/uVwjwdW5 i did change 'pkgrel' & libsoup dependency in PKGBUILD - same result. Any thoughts? Could attach full stdout if needed.

technic93 commented on 2017-05-04 21:53 (UTC) (edited on 2017-05-04 21:53 (UTC) by technic93)

replace libsoup-gnome with libsoup in PKGBUILD (in 2 places)

heapifyman commented on 2017-05-02 09:13 (UTC)

I have the same issue as JohnRobson. Is there something I can do or do I have to wait until gstreamer0.10-good-plugins is updated?

Ralf_Mardorf commented on 2017-04-28 20:16 (UTC) (edited on 2017-04-28 20:19 (UTC) by Ralf_Mardorf)

sulaweyo removing libsoup 2.56.0 isn't needed. Soname of libsoup 2.56.0 and 2.58.0 are equal, so building against libsoup 2.56.0 and after that upgrading to 2.58.0 should be ok. The official repositories still provide lib32-libsoup 2.56.0-1, so you could compare the libs with those from libsoup 2.58.0-1. Did I misse another package upgrade, that might require to upgrade before rebuilding gstreamer0.10-good?

fuan_k commented on 2017-04-28 16:12 (UTC)

Thanks for reporting sulaweyo, maintainer please update the PKGBUILD. <3 <3

sulaweyo commented on 2017-04-28 06:07 (UTC)

I have switched the libsoup-gnome dependency in depends and make-depends to just libsoup in the PKGBUILD and the build works fine. Had to uninstall this package first though to get the update in.

JohnRobson commented on 2017-04-28 01:47 (UTC)

FIXME: gstreamer0.10-good-plugins: installing libsoup (2.58.0-1) breaks dependency 'libsoup-gnome'

agentcobra commented on 2017-04-27 07:15 (UTC)

Thx Ralf

slav commented on 2017-04-25 17:24 (UTC)

Thanks Ralf!

ector commented on 2017-04-25 12:17 (UTC)

Thank@Ralf_Mardorf I solved it with your advice thank you

Ralf_Mardorf commented on 2017-04-25 08:55 (UTC)

Edit the PKGBUILD. Change pkgrel= from 27 to 28. Change the makedepends= and depends= entries 'libsoup-gnome' to 'libsoup'. This way building gstreamer0.10-good and gstreamer0.10-good-plugins works, it also resolves the dependency issue, but I didn't test if it still works :D.

slav commented on 2017-04-25 08:26 (UTC)

Guys something wrong wit dependencies... Starting full system upgrade... resolving dependencies... looking for conflicting packages... error: failed to prepare transaction (could not satisfy dependencies) :: gstreamer0.10-good-plugins: installing libsoup (2.58.0-1) breaks dependency 'libsoup-gnome'

ector commented on 2017-04-25 07:08 (UTC)

i have this error,after installing libsoup 2.58.0-1 gstreamer0.10-python : Orfano Altri pacchetti: \ 43 / 43 errore: missing 'libsoup-gnome' dependency for 'gstreamer0.10-good-plugins' I also have problems with it errore: impossibile eseguire l'operazione richiesta (file in conflitto) /usr/share/mkvtoolnix/sounds/finished-1.ogg è già presente in 'mkvtoolnix-cli' e in 'mkvtoolnix-gui' /usr/share/mkvtoolnix/sounds/finished-2.ogg è già presente in 'mkvtoolnix-cli' e in 'mkvtoolnix-gui' /usr/share/mkvtoolnix/sounds/finished-3.ogg è già presente in 'mkvtoolnix-cli' e in 'mkvtoolnix-gui' even if the following files have been removed

Swipe commented on 2017-04-25 06:27 (UTC)

Be aware that radiotray-python3-git is broken in kde plasma though

gergi commented on 2017-04-25 06:19 (UTC) (edited on 2017-04-25 06:23 (UTC) by gergi)

If you come here because of the radiotray issues with gstreamer0.10-good-plugins. Switching to AUR-package radiotray-python3-git solved the issue for me.

ljrk commented on 2017-04-24 18:30 (UTC)

Or to update using `pacman -Syudd` -- but yes, this package should be updated.

Swipe commented on 2017-04-24 18:24 (UTC)

A dirty workaround is to ignore libsoup until gstreamer0.10-good-plugins is updated

autarky commented on 2017-04-24 14:08 (UTC)

error: failed to prepare transaction (could not satisfy dependencies) :: gstreamer0.10-good-plugins: installing libsoup (2.58.0-1) breaks dependency 'libsoup-gnome

muflone commented on 2017-04-23 11:30 (UTC)

please change the libsoup-gnome dependency as libsoup 2.58.0-1 in testing has removed the provides libsoup-gnome

javum commented on 2017-04-21 03:14 (UTC)

error: failed to prepare transaction (could not satisfy dependencies) :: gstreamer0.10-good-plugins: installing libsoup (2.57.1+29+g5b6d632a-2) breaks dependency 'libsoup-gnome'

ata commented on 2017-03-17 17:21 (UTC) (edited on 2017-03-17 17:25 (UTC) by ata)

git clone https://aur.archlinux.org/gstreamer0.10-good.git cd gstreamer0.10-good makepkg -g >> PKGBUILD makepkg -sri enjoy

ector commented on 2017-01-31 09:21 (UTC)

thanks to the maintainer, I installed without problems

cybertron commented on 2017-01-30 18:53 (UTC)

Error: 'gstreamer0.10-good-plugins-0.10.31-16-x86_64.pkg.tar.xz': Twice Target same with other gstreamer0.10 stuff, building with packer

dixi_minga commented on 2017-01-28 17:07 (UTC)

I have the same problem as daedite66 has test-suite.log: FAIL: generic/states ==================== Running suite(s): states 66%: Checks: 3, Failures: 0, Errors: 1 generic/states.c:113:E:general:test_state_changes_up_and_down_seq:0: (after this point) Test timeout expired FAIL generic/states (exit status: 1)

frederick_monk commented on 2017-01-28 16:27 (UTC)

@yurikoles: Now it worked for me. gstreamer0.10-* is now up to date on my machines. Thank you!

deadite66 commented on 2017-01-28 16:16 (UTC)

FAIL: elements/souphttpsrc ============================================================================ Testsuite summary for GStreamer Good Plug-ins 0.10.31 ============================================================================ # TOTAL: 69 # PASS: 68 # SKIP: 0 # XFAIL: 0 # FAIL: 1 # XPASS: 0 # ERROR: 0 ============================================================================ See tests/check/test-suite.log Please report to http://bugzilla.gnome.org/enter_bug.cgi?product=GStreamer ============================================================================ make[4]: *** [Makefile:2948: test-suite.log] Error 1 make[4]: Leaving directory '/tmp/yaourt-tmp-lee/aur-gstreamer0.10-good/src/gst-plugins-good/tests/check' make[3]: *** [Makefile:3056: check-TESTS] Error 2 make[3]: Leaving directory '/tmp/yaourt-tmp-lee/aur-gstreamer0.10-good/src/gst-plugins-good/tests/check' make[2]: *** [Makefile:3610: check-am] Error 2 make[2]: Leaving directory '/tmp/yaourt-tmp-lee/aur-gstreamer0.10-good/src/gst-plugins-good/tests/check' make[1]: *** [Makefile:593: check-recursive] Error 1 make[1]: Leaving directory '/tmp/yaourt-tmp-lee/aur-gstreamer0.10-good/src/gst-plugins-good/tests' make: *** [Makefile:715: check-recursive] Error 1

yurikoles commented on 2017-01-28 14:28 (UTC)

@all please update

ector commented on 2017-01-28 14:17 (UTC)

Me too

Swipe commented on 2017-01-28 13:46 (UTC)

Me too

dixi_minga commented on 2017-01-28 11:51 (UTC)

also with the new version I get compiler error: make[3]: *** [Makefile:764: libgstvideo4linux2_la-gstv4l2bufferpool.lo] Error 1 make[3]: Leaving directory '/tmp/yaourt-tmp-dixi/aur-gstreamer0.10-good-plugins/src/gst-plugins-good-0.10.31/sys/v4l2' make[2]: *** [Makefile:908: v4l2] Error 2 make[2]: Leaving directory '/tmp/yaourt-tmp-dixi/aur-gstreamer0.10-good-plugins/src/gst-plugins-good-0.10.31/sys' make[1]: *** [Makefile:712: all-recursive] Error 1 make[1]: Leaving directory '/tmp/yaourt-tmp-dixi/aur-gstreamer0.10-good-plugins/src/gst-plugins-good-0.10.31' make: *** [Makefile:641: all] Error 2

nagar commented on 2017-01-28 04:49 (UTC)

Confirm Compiler error :) ==> ERROR: A failure occurred in build(). Aborting... ==> ERROR: Makepkg was unable to build gstreamer0.10-good.

Caiosama205 commented on 2017-01-28 02:59 (UTC)

Confirm the compile error here too

alfredo.ardito commented on 2017-01-27 21:09 (UTC)

Yep, same error...

teejer commented on 2017-01-27 15:11 (UTC)

I am also getting a compile error

Haron_Prime commented on 2017-01-27 13:45 (UTC)

Same here

SinClaus commented on 2017-01-27 02:52 (UTC)

I've error message with compiling this package and gstreamer0.10-good-plugin (the same). CC libgstvideofilter_la-plugin.lo In file included from /usr/include/gstreamer-0.10/gst/gst.h:32:0, from plugin.c:24: /usr/include/gstreamer-0.10/gst/gstversion.h:48:27: error: expected declaration specifiers or ‘...’ before ‘(’ token #define GST_VERSION_MAJOR (0) ^ plugin.c:43:21: note: in expansion of macro ‘GST_VERSION_MAJOR’ GST_PLUGIN_DEFINE2 (GST_VERSION_MAJOR, ^~~~~~~~~~~~~~~~~ /usr/include/gstreamer-0.10/gst/gstversion.h:54:27: error: expected declaration specifiers or ‘...’ before ‘(’ token #define GST_VERSION_MINOR (10) ^ plugin.c:44:5: note: in expansion of macro ‘GST_VERSION_MINOR’ GST_VERSION_MINOR, ^~~~~~~~~~~~~~~~~ plugin.c:45:5: error: unknown type name ‘videofilter’ videofilter, ^~~~~~~~~~~ plugin.c:46:5: error: expected declaration specifiers or ‘...’ before string constant "Video filters plugin", ^~~~~~~~~~~~~~~~~~~~~~ plugin.c:47:5: error: expected declaration specifiers or ‘...’ before ‘plugin_init’ plugin_init, VERSION, GST_LICENSE, GST_PACKAGE_NAME, GST_PACKAGE_ORIGIN); ^~~~~~~~~~~ In file included from plugin.c:21:0: ../../config.h:421:17: error: expected declaration specifiers or ‘...’ before string constant #define VERSION "0.10.31" ^ plugin.c:47:18: note: in expansion of macro ‘VERSION’ plugin_init, VERSION, GST_LICENSE, GST_PACKAGE_NAME, GST_PACKAGE_ORIGIN); ^~~~~~~ ../../config.h:39:21: error: expected declaration specifiers or ‘...’ before string constant #define GST_LICENSE "LGPL" ^ plugin.c:47:27: note: in expansion of macro ‘GST_LICENSE’ plugin_init, VERSION, GST_LICENSE, GST_PACKAGE_NAME, GST_PACKAGE_ORIGIN); ^~~~~~~~~~~ ../../config.h:42:26: error: expected declaration specifiers or ‘...’ before string constant #define GST_PACKAGE_NAME "GStreamer Good Plugins (Archlinux)" ^ ../../config.h:42:26: note: in definition of macro ‘GST_PACKAGE_NAME’ #define GST_PACKAGE_NAME "GStreamer Good Plugins (Archlinux)" ^~~~~~~~~~~~~~~~~~~~~~~~~~~~~~~~~~~~ ../../config.h:45:28: error: expected declaration specifiers or ‘...’ before string constant #define GST_PACKAGE_ORIGIN "http://www.archlinux.org/" ^ plugin.c:47:58: note: in expansion of macro ‘GST_PACKAGE_ORIGIN’ plugin_init, VERSION, GST_LICENSE, GST_PACKAGE_NAME, GST_PACKAGE_ORIGIN); ^~~~~~~~~~~~~~~~~~ plugin.c:32:1: warning: ‘plugin_init’ defined but not used [-Wunused-function] plugin_init (GstPlugin * plugin) ^~~~~~~~~~~

jewelux commented on 2017-01-26 20:42 (UTC)

I've got the following error while compiling: commment-begin==> In file included from /usr/include/gstreamer-0.10/gst/gst.h:32:0, from plugin.c:24: /usr/include/gstreamer-0.10/gst/gstversion.h:48:27: Fehler: expected declaration specifiers or »...« before »(« token #define GST_VERSION_MAJOR (0) ^ plugin.c:43:21: Anmerkung: bei Substitution des Makros »GST_VERSION_MAJOR« GST_PLUGIN_DEFINE2 (GST_VERSION_MAJOR, ^~~~~~~~~~~~~~~~~ /usr/include/gstreamer-0.10/gst/gstversion.h:54:27: Fehler: expected declaration specifiers or »...« before »(« token #define GST_VERSION_MINOR (10) ^ plugin.c:44:5: Anmerkung: bei Substitution des Makros »GST_VERSION_MINOR« GST_VERSION_MINOR, ^~~~~~~~~~~~~~~~~ plugin.c:45:5: Fehler: unbekannter Typname: »videofilter« videofilter, ^~~~~~~~~~~ plugin.c:46:5: Fehler: expected declaration specifiers or »...« before string constant "Video filters plugin", ^~~~~~~~~~~~~~~~~~~~~~ plugin.c:47:5: Fehler: expected declaration specifiers or »...« before »plugin_init« plugin_init, VERSION, GST_LICENSE, GST_PACKAGE_NAME, GST_PACKAGE_ORIGIN); ^~~~~~~~~~~ In file included from plugin.c:21:0: ../../config.h:421:17: Fehler: expected declaration specifiers or »...« before string constant #define VERSION "0.10.31" ^ plugin.c:47:18: Anmerkung: bei Substitution des Makros »VERSION« plugin_init, VERSION, GST_LICENSE, GST_PACKAGE_NAME, GST_PACKAGE_ORIGIN); ^~~~~~~ ../../config.h:39:21: Fehler: expected declaration specifiers or »...« before string constant #define GST_LICENSE "LGPL" ^ plugin.c:47:27: Anmerkung: bei Substitution des Makros »GST_LICENSE« plugin_init, VERSION, GST_LICENSE, GST_PACKAGE_NAME, GST_PACKAGE_ORIGIN); ^~~~~~~~~~~ ../../config.h:42:26: Fehler: expected declaration specifiers or »...« before string constant #define GST_PACKAGE_NAME "GStreamer Good Plugins (Archlinux)" ^ ../../config.h:42:26: Anmerkung: in Definition des Makros »GST_PACKAGE_NAME« #define GST_PACKAGE_NAME "GStreamer Good Plugins (Archlinux)" ^~~~~~~~~~~~~~~~~~~~~~~~~~~~~~~~~~~~ ../../config.h:45:28: Fehler: expected declaration specifiers or »...« before string constant #define GST_PACKAGE_ORIGIN "http://www.archlinux.org/" ^ plugin.c:47:58: Anmerkung: bei Substitution des Makros »GST_PACKAGE_ORIGIN« plugin_init, VERSION, GST_LICENSE, GST_PACKAGE_NAME, GST_PACKAGE_ORIGIN); ^~~~~~~~~~~~~~~~~~ plugin.c:32:1: Warnung: »plugin_init« defined but not used [-Wunused-function] plugin_init (GstPlugin * plugin) ^~~~~~~~~~~ make[3]: *** [Makefile:696: libgstvideofilter_la-plugin.lo] Fehler 1 make[3]: Verzeichnis „/home/rispenhirse/.cache/pacaur/gstreamer0.10-good/src/gst-plugins-good/gst/videofilter“ wird verlassen make[2]: *** [Makefile:865: videofilter] Fehler 2 make[2]: Verzeichnis „/home/rispenhirse/.cache/pacaur/gstreamer0.10-good/src/gst-plugins-good/gst“ wird verlassen make[1]: *** [Makefile:715: all-recursive] Fehler 1 make[1]: Verzeichnis „/home/rispenhirse/.cache/pacaur/gstreamer0.10-good/src/gst-plugins-good“ wird verlassen make: *** [Makefile:644: all] Fehler 2 ==> FEHLER: Ein Fehler geschah in build(). Breche ab... :: Konnte gstreamer0.10-ugly-Paket(e) nicht erstellen :: Konnte gstreamer0.10-good-plugins-Paket(e) nicht erstellen <==comment-end Compiling gstreamer0.10-ugly results in nearly the same error. Thx your for help.