Package Details: gstreamer0.10-ugly 0.10.19-29

Git Clone URL: https://aur.archlinux.org/gstreamer0.10-ugly.git (read-only, click to copy)
Package Base: gstreamer0.10-ugly
Description: GStreamer Multimedia Framework Ugly plugin libraries
Upstream URL: https://gstreamer.freedesktop.org
Licenses: LGPL
Submitter: yurikoles
Maintainer: MarsSeed
Last Packager: MarsSeed
Votes: 20
Popularity: 0.010779
First Submitted: 2017-01-26 13:59 (UTC)
Last Updated: 2022-05-05 11:27 (UTC)

Latest Comments

MarsSeed commented on 2022-05-05 13:02 (UTC)

Hm, seems this volatile type issue is coming from the upstream gstreamer0.10 dependency.

The maintainer of that package has to make a small adjustment in one of the include header files.

MarsSeed commented on 2022-05-05 11:35 (UTC)

Hi,

Sorry, I didn't realize there was an issue with the build.

Unfortunately, this glib2>2.66 header related issue with pointers and volatile types are way above my league right now.

So the only thing I could do is to disable the problematic sidplay module (Commodore 64 music file support).

Hope that's not a biggie. :)

(It it is, I need someone to solve the issue because I don't really know C/C++.)

micwoj92 commented on 2022-05-05 00:00 (UTC)

@MarsSeed do you plan on fixing this package?

Samega7Cattac commented on 2021-09-15 12:08 (UTC)

gstsiddec.cc: In function ‘GType gst_siddec_get_type()’:
/usr/include/glib-2.0/glib/gatomic.h:117:19: error: argument 2 of ‘__atomic_load’ must not be a pointer to a ‘volatile’ type
  117 |     __atomic_load (gapg_temp_atomic, &gapg_temp_newval, __ATOMIC_SEQ_CST); \
      |     ~~~~~~~~~~~~~~^~~~~~~~~~~~~~~~~~~~~~~~~~~~~~~~~~~~~~~~~~~~~~~~~~~~~~~
/usr/include/glib-2.0/glib/gthread.h:260:7: note: in expansion of macro ‘g_atomic_pointer_get’
  260 |     (!g_atomic_pointer_get (location) &&                             \
      |       ^~~~~~~~~~~~~~~~~~~~
/usr/include/gstreamer-0.10/gst/gstutils.h:140:7: note: in expansion of macro ‘g_once_init_enter’
  140 |   if (g_once_init_enter (&gonce_data)) {                                \
      |       ^~~~~~~~~~~~~~~~~
gstsiddec.cc:146:1: note: in expansion of macro ‘GST_BOILERPLATE_FULL’
  146 | GST_BOILERPLATE_FULL (GstSidDec, gst_siddec, GstElement, GST_TYPE_ELEMENT,
      | ^~~~~~~~~~~~~~~~~~~~

gcurse commented on 2018-04-01 17:36 (UTC)

Adopted. Fixed (hopefully).

@soloturn gst-plugins-... are plugins for gstreamer1.0 not for gstreamer0.10

soloturn commented on 2018-02-04 01:27 (UTC)

the newest version in extra: https://www.archlinux.org/packages/extra/x86_64/gst-plugins-ugly/

quattro commented on 2017-11-26 11:32 (UTC)

Same error while building package ((( please help!

simona commented on 2017-10-17 10:08 (UTC)

make[3]: *** [Makefile:612: libgstasf_la-gstasf.lo] Error 1 make[3]: uscita dalla directory "/tmp/yaourt-tmp-simona/aur-gstreamer0.10-ugly/src/gst-plugins-ugly/gst/asfdemux" make[2]: *** [Makefile:781: asfdemux] Error 2 make[2]: uscita dalla directory "/tmp/yaourt-tmp-simona/aur-gstreamer0.10-ugly/src/gst-plugins-ugly/gst" make[1]: *** [Makefile:600: all-recursive] Error 1 make[1]: uscita dalla directory "/tmp/yaourt-tmp-simona/aur-gstreamer0.10-ugly/src/gst-plugins-ugly" make: *** [Makefile:529: all] Error 2 ==> ERRORE: Si è verificato un errore in build(). L'operazione sta per essere interrotta... ==> ERRORE: Makepkg non è riuscito a compilare gstreamer0.10-ugly.

yurikoles commented on 2017-02-10 13:34 (UTC)

@tilutza done, please check other packages as well.

tilutza commented on 2017-02-09 22:44 (UTC)

I confirm that is working for armv7h. Can you change the config please ?

Cavsfan commented on 2017-02-01 23:08 (UTC)

I can confirm that it installs OK now.

ector commented on 2017-01-31 09:20 (UTC)

thanks to the maintainer, I installed without problems

youngunix commented on 2017-01-31 02:44 (UTC)

I am getting the following error "Cloning into 'gst-plugins-base'... done. warning: remote HEAD refers to nonexistent ref, unable to checkout. Switched to a new branch 'makepkg'" Per Github: "This error occurs if the default branch of a repository has been deleted on GitHub. To fix the error, you'll need to be an administrator of the repository on GitHub. You'll want to change the default branch of the repository."

liamdawe commented on 2017-01-29 21:21 (UTC)

It doesn't build for me still. See error here: http://pastebin.com/LcjswHB5

mozo commented on 2017-01-29 10:39 (UTC)

Everything is ok now :)

Trollwut commented on 2017-01-29 04:42 (UTC)

Now it builds fine for me. :-)

alfredo.ardito commented on 2017-01-27 21:07 (UTC)

Same error...

juliohm commented on 2017-01-27 18:46 (UTC)

make[3]: Entering directory '/tmp/yaourt-tmp-juliohm/aur-gstreamer0.10-ugly/src/gst-plugins-ugly/gst/asfdemux' CC libgstasf_la-gstasfdemux.lo CC libgstasf_la-gstasf.lo In file included from /usr/include/gstreamer-0.10/gst/gst.h:32:0, from gstasf.c:24: /usr/include/gstreamer-0.10/gst/gstversion.h:48:27: error: expected declaration specifiers or ‘...’ before ‘(’ token #define GST_VERSION_MAJOR (0) ^ gstasf.c:68:21: note: in expansion of macro ‘GST_VERSION_MAJOR’ GST_PLUGIN_DEFINE2 (GST_VERSION_MAJOR, ^~~~~~~~~~~~~~~~~ /usr/include/gstreamer-0.10/gst/gstversion.h:54:27: error: expected declaration specifiers or ‘...’ before ‘(’ token #define GST_VERSION_MINOR (10) ^ gstasf.c:69:5: note: in expansion of macro ‘GST_VERSION_MINOR’ GST_VERSION_MINOR, ^~~~~~~~~~~~~~~~~ gstasf.c:70:5: error: unknown type name ‘asf’ asf, ^~~ gstasf.c:71:5: error: expected declaration specifiers or ‘...’ before string constant "Demuxes and muxes audio and video in Microsofts ASF format", ^~~~~~~~~~~~~~~~~~~~~~~~~~~~~~~~~~~~~~~~~~~~~~~~~~~~~~~~~~~~ gstasf.c:72:5: error: expected declaration specifiers or ‘...’ before ‘plugin_init’ plugin_init, VERSION, GST_LICENSE, GST_PACKAGE_NAME, GST_PACKAGE_ORIGIN) ^~~~~~~~~~~ In file included from gstasf.c:21:0: ../../config.h:264:17: error: expected declaration specifiers or ‘...’ before string constant #define VERSION "0.10.19" ^ gstasf.c:72:18: note: in expansion of macro ‘VERSION’ plugin_init, VERSION, GST_LICENSE, GST_PACKAGE_NAME, GST_PACKAGE_ORIGIN) ^~~~~~~ ../../config.h:42:21: error: expected declaration specifiers or ‘...’ before string constant #define GST_LICENSE "LGPL" ^ gstasf.c:72:27: note: in expansion of macro ‘GST_LICENSE’ plugin_init, VERSION, GST_LICENSE, GST_PACKAGE_NAME, GST_PACKAGE_ORIGIN) ^~~~~~~~~~~ ../../config.h:45:26: error: expected declaration specifiers or ‘...’ before string constant #define GST_PACKAGE_NAME "GStreamer Ugly Plugins (Archlinux)" ^ ../../config.h:45:26: note: in definition of macro ‘GST_PACKAGE_NAME’ #define GST_PACKAGE_NAME "GStreamer Ugly Plugins (Archlinux)" ^~~~~~~~~~~~~~~~~~~~~~~~~~~~~~~~~~~~ ../../config.h:48:28: error: expected declaration specifiers or ‘...’ before string constant #define GST_PACKAGE_ORIGIN "http://www.archlinux.org/" ^ gstasf.c:72:58: note: in expansion of macro ‘GST_PACKAGE_ORIGIN’ plugin_init, VERSION, GST_LICENSE, GST_PACKAGE_NAME, GST_PACKAGE_ORIGIN) ^~~~~~~~~~~~~~~~~~ gstasf.c:35:1: warning: ‘plugin_init’ defined but not used [-Wunused-function] plugin_init (GstPlugin * plugin) ^~~~~~~~~~~ make[3]: *** [Makefile:612: libgstasf_la-gstasf.lo] Error 1 make[3]: Leaving directory '/tmp/yaourt-tmp-juliohm/aur-gstreamer0.10-ugly/src/gst-plugins-ugly/gst/asfdemux' make[2]: *** [Makefile:781: asfdemux] Error 2 make[2]: Leaving directory '/tmp/yaourt-tmp-juliohm/aur-gstreamer0.10-ugly/src/gst-plugins-ugly/gst' make[1]: *** [Makefile:600: all-recursive] Error 1 make[1]: Leaving directory '/tmp/yaourt-tmp-juliohm/aur-gstreamer0.10-ugly/src/gst-plugins-ugly' make: *** [Makefile:529: all] Error 2 ==> ERROR: A failure occurred in build(). Aborting... ==> ERROR: Makepkg was unable to build gstreamer0.10-ugly.

cml commented on 2017-01-27 13:24 (UTC)

Same problem.

lubo08 commented on 2017-01-27 10:48 (UTC)

Same problem.

cbowman57 commented on 2017-01-27 10:14 (UTC)

Failure to build, identical problem as Trollwut

mozo commented on 2017-01-27 10:12 (UTC)

I also can't update: make[3]: *** [Makefile:612: libgstasf_la-gstasf.lo] Error 1 make[3]: Leaving directory '/tmp/makepkg/gstreamer0.10-ugly/src/gst-plugins-ugly/gst/asfdemux' make[2]: *** [Makefile:781: asfdemux] Error 2 make[2]: Leaving directory '/tmp/makepkg/gstreamer0.10-ugly/src/gst-plugins-ugly/gst' make[1]: *** [Makefile:600: all-recursive] Error 1 make[1]: Leaving directory '/tmp/makepkg/gstreamer0.10-ugly/src/gst-plugins-ugly' make: *** [Makefile:529: all] Error 2 ==> ERROR: A failure occurred in build(). Aborting... ==> ERROR: Makepkg was unable to build gstreamer0.10-ugly. ==> Restart building gstreamer0.10-ugly-plugins ? [y/N] And this error: gstasf.c:69:5: note: in expansion of macro ‘GST_VERSION_MINOR’ GST_VERSION_MINOR, ^~~~~~~~~~~~~~~~~ gstasf.c:70:5: error: unknown type name ‘asf’ asf, ^~~ gstasf.c:71:5: error: expected declaration specifiers or ‘...’ before string constant "Demuxes and muxes audio and video in Microsofts ASF format", ^~~~~~~~~~~~~~~~~~~~~~~~~~~~~~~~~~~~~~~~~~~~~~~~~~~~~~~~~~~~ gstasf.c:72:5: error: expected declaration specifiers or ‘...’ before ‘plugin_init’ plugin_init, VERSION, GST_LICENSE, GST_PACKAGE_NAME, GST_PACKAGE_ORIGIN) ^~~~~~~~~~~ In file included from gstasf.c:21:0: ../../config.h:264:17: error: expected declaration specifiers or ‘...’ before string constant #define VERSION "0.10.19" ^ gstasf.c:72:18: note: in expansion of macro ‘VERSION’ plugin_init, VERSION, GST_LICENSE, GST_PACKAGE_NAME, GST_PACKAGE_ORIGIN) ^~~~~~~ ../../config.h:42:21: error: expected declaration specifiers or ‘...’ before string constant #define GST_LICENSE "LGPL" ^ gstasf.c:72:27: note: in expansion of macro ‘GST_LICENSE’ plugin_init, VERSION, GST_LICENSE, GST_PACKAGE_NAME, GST_PACKAGE_ORIGIN) ^~~~~~~~~~~ ../../config.h:45:26: error: expected declaration specifiers or ‘...’ before string constant #define GST_PACKAGE_NAME "GStreamer Ugly Plugins (Archlinux)" ^ ../../config.h:45:26: note: in definition of macro ‘GST_PACKAGE_NAME’ #define GST_PACKAGE_NAME "GStreamer Ugly Plugins (Archlinux)" ^~~~~~~~~~~~~~~~~~~~~~~~~~~~~~~~~~~~ ../../config.h:48:28: error: expected declaration specifiers or ‘...’ before string constant #define GST_PACKAGE_ORIGIN "http://www.archlinux.org/" ^ gstasf.c:72:58: note: in expansion of macro ‘GST_PACKAGE_ORIGIN’ plugin_init, VERSION, GST_LICENSE, GST_PACKAGE_NAME, GST_PACKAGE_ORIGIN) ^~~~~~~~~~~~~~~~~~ gstasf.c:35:1: warning: ‘plugin_init’ defined but not used [-Wunused-function] plugin_init (GstPlugin * plugin) ^~~~~~~~~~~ make[3]: *** [Makefile:612: libgstasf_la-gstasf.lo] Error 1 make[3]: Leaving directory '/tmp/makepkg/gstreamer0.10-ugly/src/gst-plugins-ugly/gst/asfdemux' make[2]: *** [Makefile:781: asfdemux] Error 2 make[2]: Leaving directory '/tmp/makepkg/gstreamer0.10-ugly/src/gst-plugins-ugly/gst' make[1]: *** [Makefile:600: all-recursive] Error 1 make[1]: Leaving directory '/tmp/makepkg/gstreamer0.10-ugly/src/gst-plugins-ugly' make: *** [Makefile:529: all] Error 2 ==> ERROR: A failure occurred in build(). Aborting... ==> ERROR: Makepkg was unable to build gstreamer0.10-ugly. ==> Restart building gstreamer0.10-ugly ? [y/N] ==> ------------------------------------------- ==> ==> ERROR: unable to update

Trollwut commented on 2017-01-26 21:58 (UTC)

In the newest version (0.10.19-16) I can't build it anymore. Any way to solve it? Error: gstasf.c:35:1: warning: ‘plugin_init’ defined but not used [-Wunused-function] plugin_init (GstPlugin * plugin) ^~~~~~~~~~~ make[3]: *** [Makefile:612: libgstasf_la-gstasf.lo] Error 1 make[3]: Leaving directory '/tmp/yaourt-tmp-cedric/aur-gstreamer0.10-ugly-plugins/src/gst-plugins-ugly/gst/asfdemux' make[2]: *** [Makefile:781: asfdemux] Error 2 make[2]: Leaving directory '/tmp/yaourt-tmp-cedric/aur-gstreamer0.10-ugly-plugins/src/gst-plugins-ugly/gst' make[1]: *** [Makefile:600: all-recursive] Error 1 make[1]: Leaving directory '/tmp/yaourt-tmp-cedric/aur-gstreamer0.10-ugly-plugins/src/gst-plugins-ugly' make: *** [Makefile:529: all] Error 2 ==> ERROR: A failure occurred in build(). Aborting... ==> ERROR: Makepkg was unable to build gstreamer0.10-ugly. ==> Restart building gstreamer0.10-ugly-plugins ? [y/N] ==> --------------------------------------------------- ==> ==> ERROR: unable to update