Package Details: gtk-engine-murrine-git 0.98.2.r406.2032a9b-1

Git Clone URL: https://aur.archlinux.org/gtk-engine-murrine-git.git (read-only)
Package Base: gtk-engine-murrine-git
Description: The marvelous gtk2 cairo engine (development version)
Upstream URL: http://cimitan.com/murrine/
Licenses: LGPL
Conflicts: gtk-engine-murrine
Provides: gtk-engine-murrine
Submitter: zhuqin
Maintainer: carstene1ns
Last Packager: carstene1ns
Votes: 284
Popularity: 0.221895
First Submitted: 2009-04-17 18:46
Last Updated: 2015-07-08 03:24

Required by (125)

Sources (2)

Latest Comments

artemh commented on 2016-02-03 20:51

Updated for automake-1.15:

newer-automakes.patch: http://pastebin.com/psX9Q0jd
PKGBUILD: http://pastebin.com/CYx0c4Ku

manuelschneid3r commented on 2015-03-20 12:11

Change 'gtk-engine-murrine-git' to 'gtk-engine-murrine' and build() to package helps.

manuelschneid3r commented on 2015-03-20 12:09

Engine murrine collides murrine-git. After after adjusting the dependencies. Function package is still missing.

carstene1ns commented on 2014-10-10 19:51

Package adopted and fixed.

carstene1ns commented on 2014-10-10 17:53

Package updated and fixed.

Dasonk commented on 2014-10-05 23:59

You should add git as a make dependency

juancate commented on 2013-12-15 05:34

fro_ozen, the files I put work. You just have to copy them and if the checksum fails you just must replace it for its correct value.

fro_ozen commented on 2013-12-14 17:50

I am having troubles installing this. Please look at my post in the forums for further information: https://bbs.archlinux.org/viewtopic.php?pid=1360185#p1360185

fro_ozen commented on 2013-12-14 17:49

I am having troubles intalling this. Please look at my post in the forums for further information.

Tjuh commented on 2013-11-23 16:00

Worked like a charm! Thank you.

Tjuh commented on 2013-11-23 15:39

The validity check on automake-1.14.patch fails. I downloaded your file from pastebin and renamed it to automake-1.14.patch but it didn't pass the check, then I created a blank file and copied the automake-1.14.patch contents but this failed also.

juancate commented on 2013-11-23 00:57

I solved the error that stackptr described by adding a patch for automake-1.14 just like the other two patches and adding it to the PKGBUILD. Here is a copy of these files:

automake-1.14.patch : http://pastebin.com/D5anhe8v
PKGBUILD : http://pastebin.com/ngMW8v53

kevincox commented on 2013-08-21 18:43

I get the same error as stackptr.

Apparently AM_DISABLE_STATIC is a depreciated alias for AC_DISABLE_STATIC however I don't know why that would cause a failure.

stackptr commented on 2013-07-30 17:41

Same error as sotokoya. Installing automake-1.7 from AUR allows me to get past that error, only to get a build error:

checking for a BSD-compatible install... /usr/bin/install -c
checking whether make sets $(MAKE)... yes
./configure: line 2702: AM_DISABLE_STATIC: command not found
./configure: line 2703: AC_LIBTOOL_WIN32_DLL: command not found
./configure: line 2704: AM_PROG_LIBTOOL: command not found
./configure: line 2706: syntax error near unexpected token `0.37.1'
./configure: line 2706: `AC_PROG_INTLTOOL(0.37.1)'
==> ERROR: A failure occurred in build().
Aborting...
The build failed.

Anonymous comment on 2013-06-30 00:04

-> Starting build...

You must have automake 1.7.x installed to compile .
Install the appropriate package for your distribution,
or get the source tarball at http://ftp.gnu.org/gnu/automake/

aphanic commented on 2013-06-02 11:46

Hi Jristz, I've updated the package to reflect pacman 4.1 source arrays and version schemes and added a patch for automake 1.13.

It should build without errors now.

Jristz commented on 2013-06-01 18:33

-> Patching...
patching file autogen.sh
-> Starting build...

You must have automake 1.7.x installed to compile .
Install the appropriate package for your distribution,
or get the source tarball at http://ftp.gnu.org/gnu/automake/
==> ERROR

KaiSforza commented on 2013-04-10 21:45

This should be updated to reflect the new pacman 4.1 source array and version scheme.

Anonymous comment on 2013-02-12 02:20

@Shiz0
Can you clarify how to apply the patch?
Using it as a *.sh scripts gives syntax errors.

Anonymous comment on 2012-05-04 23:08

Shiz0, it's not the AUR package fault, it's murrine's fault. I just reported this:

https://bugzilla.gnome.org/show_bug.cgi?id=675484

Use the patch I posted and it will work :)

Anonymous comment on 2012-04-28 14:24

Cloning into '/tmp/yaourt-tmp-shiz0/aur-gtk-engine-murrine-git/src/gtk-engine-murrine-build'...
done.

You must have automake 1.7.x installed to compile .
Install the appropriate package for your distribution,
or get the source tarball at http://ftp.gnu.org/gnu/automake/

==> ERROR: Makepkg was unable to build gtk-engine-murrine-git.
==> Restart building gtk-engine-murrine-git ? [y/N]

I have the latest automake version installed. Please, fix it.

hobarrera commented on 2012-04-05 00:49

Could you add "provides=('gtk-engine-murrine=0.98.1.1')", so packages that require "gtk-engine-murrine" work with this as well?

Grus commented on 2012-01-12 08:24

Fails with:

./configure: line 12972: syntax error near unexpected token `GTK,'
./configure: line 12972: `PKG_CHECK_MODULES(GTK, gtk+-2.0 >= 2.18.0,,'
==> ERROR: A failure occurred in build().

gadget3000 commented on 2011-07-01 23:35

I also get the automake error but I've just installed it from [core] and it's worked fine, so the version number doesn't need to be 1.7 as specified in the error.

zhuqin commented on 2011-04-01 10:48

Unable to reproduce.

Xaero252 commented on 2011-03-30 19:35

Unable to compile currently. Wants specifically automake1.7 which is unavailable in the AUR and regular repositories.

You must have automake 1.7.x installed to compile .
Install the appropriate package for your distribution,
or get the source tarball at http://ftp.gnu.org/gnu/automake/

zhuqin commented on 2011-02-26 14:09

are you sure you've installed gtk2?

Anonymous comment on 2011-02-25 16:55

I try to compile this and have this error while building :


In file included from ./src/animation.c:21:0:
./src/animation.h:24:21: fatal error: gtk/gtk.h: No such file or directory
compilation terminated.
make[1]: *** [animation.lo] Erreur 1
make[1]: quittant le répertoire « ~/builds/gtk-engine-murrine-git/gtk-engine-murrine-git/src/gtk-engine-murrine-build »
make: *** [all-recursive] Erreur 1

jsteel commented on 2010-08-30 07:25

I get the following error:

./configure: line 12256: syntax error near unexpected token `GTK,'
./configure: line 12256: `PKG_CHECK_MODULES(GTK, gtk+-2.0 >= 2.18.0,,'
Aborting...

Am I missing something?

LeCrayonVert commented on 2010-08-05 08:48

Each time I run yaourt --sucre, it wants to recompile gtk-engine-murrine-git...what is wrong ? (it may be related to the date in PKGBUILD)...

Anonymous comment on 2010-07-26 15:23

thanks :) but still have a problem with metacity, not fully look like ubuntu.

ganlu commented on 2010-06-18 23:41

There is likely a bug of makepkg, when you use non en_US environment, you can't get 'pkgver' automatically updated to the current date saying 20100618 but stayed as of the PKGBUILD.

Hund commented on 2010-06-18 18:45

Why is it flagged out of date?

Anonymous comment on 2010-06-14 16:27

uh! ehm...ok thanks! shame on me!xD

zhuqin commented on 2010-06-14 16:23

http://wiki.archlinux.org/index.php/AUR_User_Guidelines#Prerequisites

Anonymous comment on 2010-06-14 16:12

I suggest to include 'autoconf' to the dependencies! Some seconds ago I'd to include it manually! :D

zhuqin commented on 2010-03-26 00:40

It's been fixed 9 hours ago, please try it again.

Anonymous comment on 2010-03-25 15:08

I'm trying to install this, but it fails durring compile time.

This is the output I am getting as it fails.

./src/murrine_rc_style.c: In function ‘murrine_rc_style_parse’:
./src/murrine_rc_style.c:638: warning: passing argument 3 of ‘theme_parse_boolean’ from incompatible pointer type
./src/murrine_rc_style.c:242: note: expected ‘gboolean *’ but argument is of type ‘struct GtkRcStyle *’
./src/murrine_rc_style.c:638: error: too many arguments to function ‘theme_parse_boolean’
make[1]: *** [murrine_rc_style.lo] Error 1
make[1]: Leaving directory `/tmp/yaourt-tmp-umer/aur-gtk-engine-murrine-git/gtk-engine-murrine-git/src/gtk-engine-murrine-build'
make: *** [all-recursive] Error 1
==> ERROR: Build Failed.
Aborting...
Error: Makepkg was unable to build gtk-engine-murrine-git package.