Package Details: gtk-theme-shiki-colors-revival 2.0.1-1

Git Clone URL: (read-only, click to copy)
Package Base: gtk-theme-shiki-colors-revival
Description: Shiki Colors GTK theme, based off Numix
Upstream URL:
Licenses: GPL, GPL3, ISC
Submitter: polyzen
Maintainer: None
Last Packager: polyzen
Votes: 1
Popularity: 0.000000
First Submitted: 2015-09-21 18:54 (UTC)
Last Updated: 2015-09-21 19:01 (UTC)

Latest Comments

aphirst commented on 2018-01-17 15:29 (UTC)

This now totally fails to build.

aphirst commented on 2017-12-20 18:13 (UTC)

It seems someone else has taken the reins for this project.

Propose changing source accordingly?

aphirst commented on 2016-05-26 01:20 (UTC)

Seems to require ruby-sass as per comments at

aphirst commented on 2016-05-26 01:20 (UTC)

make[1]: scss: Command not found Makefile:15: recipe for target 'css' failed make[1]: *** [css] Error 127 make[1]: Leaving directory '/tmp/yaourt-tmp-adam/aur-shiki-colors-revival-git/src/shiki-colors-revival-build/numix-themes' Makefile:94: recipe for target '/tmp/yaourt-tmp-adam/aur-shiki-colors-revival-git/src/shiki-colors-revival-build//generated/.prepare' failed make: *** [/tmp/yaourt-tmp-adam/aur-shiki-colors-revival-git/src/shiki-colors-revival-build//generated/.prepare] Error 2

aphirst commented on 2015-09-21 19:53 (UTC)

==> Starting build()... [[ "" ]] || git submodule init fatal: Not a git repository (or any parent up to mount point /tmp) Stopping at filesystem boundary (GIT_DISCOVERY_ACROSS_FILESYSTEM not set). Makefile:82: recipe for target 'prepare' failed make: *** [prepare] Error 128 ==> ERROR: A failure occurred in build(). Aborting...