Package Details: gtox-git alpha.r301.g3ae68fb-1

Git Clone URL: https://aur.archlinux.org/gtox-git.git (read-only)
Package Base: gtox-git
Description: a GTK-based tox-client
Upstream URL: https://github.com/KoKuToru/gTox.git
Licenses: GPL3
Conflicts: gtox
Submitter: KoKuToru
Maintainer: None
Last Packager: KoKuToru
Votes: 12
Popularity: 0.000600
First Submitted: 2014-10-12 09:13
Last Updated: 2016-02-24 17:20

Latest Comments

marmistrz commented on 2017-02-14 13:42

I guess it would be good to write in the description, that upstream has abandoned the project.

escentrix commented on 2016-02-24 18:08

@KoKuToru I ran some updates, rebooted and recompiled and it went okay this time. Thanks for the update though!

KoKuToru commented on 2016-02-24 17:25

@escentrix thanks for the info, I updated the license-part.

But I can't reproduce the `No rule to make target..` problem..

escentrix commented on 2016-02-24 17:14

I get the following error when building:

==> Building and installing package
==> ERROR: license should be an array
==> ERROR: Makepkg was unable to build gtox-git.

If I change the line in PKGBUILD from license='GPL3' to license=('GPL3') it fixes it.

Edit: I get stuck after that with another error:
Scanning dependencies of target gtox
[ 60%] Building CXX object CMakeFiles/gtox.dir/main.cpp.o
[ 61%] Building CXX object CMakeFiles/gtox.dir/gtox.cpp.o
[ 62%] Building CXX object CMakeFiles/gtox.dir/config.cpp.o
[ 63%] Building CXX object CMakeFiles/gtox.dir/dialog/error.cpp.o
[ 65%] Building CXX object CMakeFiles/gtox.dir/dialog/profile_selection.cpp.o
make[2]: *** No rule to make target '../dialog/profile_create.cpp', needed by 'CMakeFiles/gtox.dir/dialog/profile_create.cpp.o'. Stop.
CMakeFiles/Makefile2:73: recipe for target 'CMakeFiles/gtox.dir/all' failed
make[1]: *** [CMakeFiles/gtox.dir/all] Error 2
Makefile:127: recipe for target 'all' failed
make: *** [all] Error 2

KoKuToru commented on 2015-08-24 19:41

@DoctorJellyface

thats bad.. older versions did work ?
I just can imagine your LC_ALL values is C ?
Translations are horrible right now (the way I use gettext)..
I will try to fix this as fast as possible, I will write again when I did

@vlad
This is a *-git package ? I feel no reason to update to a non-git toxcore

DoctorJellyface commented on 2015-08-24 05:59

@vlad, that is awesome!

Also, I get a "Could not find translation files error" when I try to run gTox. That's the third update in a row that has done that.

I have en_US and sk_SK (both UTF-8) in my locale.gen.

vlad commented on 2015-08-22 11:28

toxcore has been included in the official packages: https://www.archlinux.org/packages/?q=toxcore

KoKuToru commented on 2015-06-06 11:40

Will have lots of `deprecated-declarations`-Warnings (in glibmm),
but should build now.

PerfectGentleman commented on 2015-06-06 07:31

/var/tmp/gtox-git/src/gtox/Source/Libs/SQLiteCpp/include/SQLiteCpp/Exception.h:53:25: error: expected identifier before ‘throw’
#define noexcept throw()
^
/var/tmp/gtox-git/src/gtox/Source/Libs/SQLiteCpp/include/SQLiteCpp/Exception.h:53:25: error: expected ‘,’ or ‘...’ before ‘throw’
In file included from /usr/include/c++/5.1.0/stack:61:0,
from /usr/include/glibmm-2.4/glibmm/nodetree.h:26,
from /usr/include/glibmm-2.4/glibmm.h:122,
from /var/tmp/gtox-git/src/gtox/Source/Tox/ToxProfile.h:27,
from /var/tmp/gtox-git/src/gtox/Source/Tox/Toxmm.h:33,
from /var/tmp/gtox-git/src/gtox/Source/Helper/gToxObservable.h:22,
from /var/tmp/gtox-git/src/gtox/Source/Helper/gToxObservable.cpp:20:
/usr/include/c++/5.1.0/bits/stl_stack.h:224:40: error: ‘swap’ declared as function returning a function
noexcept(noexcept(swap(c, __s.c)))
^
/usr/include/c++/5.1.0/bits/stl_stack.h:295:13: error: initializer provided for function
noexcept(noexcept(__x.swap(__y)))
^
In file included from /var/tmp/gtox-git/src/gtox/Source/Libs/SQLiteCpp/include/SQLiteCpp/Statement.h:16:0,
from /var/tmp/gtox-git/src/gtox/Source/Libs/SQLiteCpp/include/SQLiteCpp/Column.h:15,
from /var/tmp/gtox-git/src/gtox/Source/Libs/SQLiteCpp/include/SQLiteCpp/Database.h:15,
from /var/tmp/gtox-git/src/gtox/Source/Tox/Toxmm.h:29,
from /var/tmp/gtox-git/src/gtox/Source/Helper/gToxObserver.h:22,
from /var/tmp/gtox-git/src/gtox/Source/Helper/gToxObserver.cpp:20:
/var/tmp/gtox-git/src/gtox/Source/Libs/SQLiteCpp/include/SQLiteCpp/Exception.h:53:25: error: expected identifier before ‘throw’
#define noexcept throw()
^
/var/tmp/gtox-git/src/gtox/Source/Libs/SQLiteCpp/include/SQLiteCpp/Exception.h:53:25: error: expected ‘,’ or ‘...’ before ‘throw’
In file included from /usr/include/c++/5.1.0/stack:61:0,
from /usr/include/glibmm-2.4/glibmm/nodetree.h:26,
from /usr/include/glibmm-2.4/glibmm.h:122,
from /var/tmp/gtox-git/src/gtox/Source/Tox/ToxProfile.h:27,
from /var/tmp/gtox-git/src/gtox/Source/Tox/Toxmm.h:33,
from /var/tmp/gtox-git/src/gtox/Source/Helper/gToxObserver.h:22,
from /var/tmp/gtox-git/src/gtox/Source/Helper/gToxObserver.cpp:20:
/usr/include/c++/5.1.0/bits/stl_stack.h:224:40: error: ‘swap’ declared as function returning a function
noexcept(noexcept(swap(c, __s.c)))
^
/usr/include/c++/5.1.0/bits/stl_stack.h:295:13: error: initializer provided for function
noexcept(noexcept(__x.swap(__y)))
^
CMakeFiles/gTox.dir/build.make:112: recipe for target 'CMakeFiles/gTox.dir/Helper/gToxObservable.cpp.o' failed
make[2]: *** [CMakeFiles/gTox.dir/Helper/gToxObservable.cpp.o] Error 1
make[2]: *** Waiting for unfinished jobs....
CMakeFiles/gTox.dir/build.make:135: recipe for target 'CMakeFiles/gTox.dir/Helper/gToxObserver.cpp.o' failed
make[2]: *** [CMakeFiles/gTox.dir/Helper/gToxObserver.cpp.o] Error 1
CMakeFiles/Makefile2:64: recipe for target 'CMakeFiles/gTox.dir/all' failed
make[1]: *** [CMakeFiles/gTox.dir/all] Error 2
Makefile:116: recipe for target 'all' failed
make: *** [all] Error 2
==> ERROR: A failure occurred in build().

KoKuToru commented on 2014-12-22 06:43

oh man.. thanks a lot for the help.

I uploaded the updated PKGBUILD
and it works now.

All comments