Package Details: guile-gcrypt 0.3.0-1

Git Clone URL: https://aur.archlinux.org/guile-gcrypt.git (read-only, click to copy)
Package Base: guile-gcrypt
Description: Guile bindings for libgcrypt
Upstream URL: https://notabug.org/cwebber/guile-gcrypt
Keywords: gcrypt guile
Licenses: GPL3
Submitter: joehillen
Maintainer: lantw44
Last Packager: lantw44
Votes: 4
Popularity: 0.003629
First Submitted: 2018-09-28 19:53
Last Updated: 2021-02-15 16:03

Required by (2)

Sources (1)

Latest Comments

simona commented on 2021-02-26 09:59

make: *** [Makefile:1426: gcrypt/hash.go] Errore 1

tleydxdy commented on 2021-02-26 08:03

that worked, thanks!

lantw44 commented on 2021-02-14 17:34

Does it build if you remove the older version first?

tleydxdy commented on 2021-02-12 02:18

yep build fails

ice-9/boot-9.scm:752:25: ice-9/boot-9.scm:752:25: In procedure dispatch-exception:
Syntax error:
gcrypt/hash.scm:83:0: source expression failed to match any pattern in form (define-enumerate-type hash-algorithm lookup-hash-algorithm hash-algorithm-name (md5 1) (sha1 2) (rmd160 3) (tiger 6) (haval 7) (sha256 8) (sha384 9) (sha512 10) (sha224 11) (md4 301) (crc32 302) (crc32-rfc1510 303) (crc24-rfc2440 304) (whirlpool 305) (tiger1 306) (tiger2 307) (gostr3411-94 308) (stribog256 309) (stribog512 310) (gostr3411-cp 311) (sha3-224 312) (sha3-256 313) (sha3-384 314) (sha3-512 315) (blake2b-512 318) (blake2b-384 319) (blake2b-256 320) (blake2b-160 321) (blake2s-256 322) (blake2s-224 323) (blake2s-160 324) (blake2s-128 325))
In procedure dispatch-exception:
Syntax error:
gcrypt/mac.scm:66:0: source expression failed to match any pattern in form (define-enumerate-type mac-algorithm lookup-mac-algorithm mac-algorithm-name (hmac-sha256 101) (hmac-sha224 102) (hmac-sha512 103) (hmac-sha384 104) (hmac-sha1 105) (hmac-md5 106) (hmac-md4 107) (hmac-rmd160 108) (hmac-tiger1 109) (hmac-whirlpool 110) (hmac-gostr3411-94 111) (hmac-stribog256 112) (hmac-stribog512 113) (hmac-sha3-224 115) (hmac-sha3-256 116) (hmac-sha3-384 117) (hmac-sha3-512 118) (cmac-aes 201) (cmac-3des 202) (cmac-camellia 203) (cmac-cast5 204) (cmac-blowfish 205) (cmac-twofish 206) (cmac-serpent 207) (cmac-seed 208) (cmac-rfc2268 209) (cmac-idea 210) (cmac-gost28147 211) (gmac-aes 401) (gmac-camellia 402) (gmac-twofish 403) (gmac-serpent 404) (gmac-seed 405) (poly1305 501) (poly1305-aes 502) (poly1305-camellia 503) (poly1305-twofish 504) (poly1305-serpent 505) (poly1305-seed 506))
make: *** [Makefile:1426: gcrypt/hash.go] Error 1
make: *** Waiting for unfinished jobs....
make: *** [Makefile:1426: gcrypt/mac.go] Error 1
wrote `gcrypt/package-config.go'
wrote `gcrypt/hmac.go'
wrote `gcrypt/base16.go'
wrote `gcrypt/internal.go'
wrote `gcrypt/base64.go'
wrote `gcrypt/common.go'
==> ERROR: A failure occurred in build().
    Aborting...
error making: guile-gcrypt

haawda commented on 2021-02-08 00:12

Please let the PKGBUILD download a tarball with the packagename in its name.

source=("$pkgname-$pkgver.tar.gz::...)

simona commented on 2021-02-07 18:20

gcrypt/hash.scm:83:0: source expression failed to match any pattern in form (define-enumerate-type hash-algorithm lookup-hash-algorithm hash-algorithm-name (md5 1) (sha1 2) (rmd160 3) (tiger 6) (haval 7) (sha256 8) (sha384 9) (sha512 10) (sha224 11) (md4 301) (crc32 302) (crc32-rfc1510 303) (crc24-rfc2440 304) (whirlpool 305) (tiger1 306) (tiger2 307) (gostr3411-94 308)(stribog256 309) (stribog512 310) (gostr3411-cp 311) (sha3-224 312) (sha3-256 313) (sha3-384 314) (sha3-512 315) (blake2b-512 318) (blake2b-384 319) (blake2b-256 320) (blake2b-160 321) (blake2s-256 322) (blake2s-224 323) (blake2s-160 324) (blake2s-128 325))
make: *** [Makefile:1426: gcrypt/hash.go] Errore 1

lantw44 commented on 2020-08-12 15:57

@azmeuk Does it work if you remove the existing version of guile-gcrypt first?

azmeuk commented on 2020-08-11 08:27

I have an error installing this package:

env LANG=C yay -S guile-gcrypt --noconfirm
:: Checking for conflicts...
:: Checking for inner conflicts...
[Aur:1]  guile-gcrypt-0.2.1-1

  1 guile-gcrypt                     (Installed) (Build Files Exist)
==> Packages to cleanBuild?
==> [N]one [A]ll [Ab]ort [I]nstalled [No]tInstalled or (1 2 3, 1-3, ^4)
==>
:: PKGBUILD up to date, Skipping (1/1): guile-gcrypt
  1 guile-gcrypt                     (Installed) (Build Files Exist)
==> Diffs to show?
==> [N]one [A]ll [Ab]ort [I]nstalled [No]tInstalled or (1 2 3, 1-3, ^4)
==>
:: (1/1) Parsing SRCINFO: guile-gcrypt
==> Making package: guile-gcrypt 0.2.1-1 (mar. 11 août 2020 10:25:59)
==> Retrieving sources...
  -> Found v0.2.1.tar.gz
==> Validating source files with sha256sums...
    v0.2.1.tar.gz ... Passed
==> Making package: guile-gcrypt 0.2.1-1 (mar. 11 août 2020 10:26:00)
==> Checking runtime dependencies...
==> Checking buildtime dependencies...
==> Retrieving sources...
  -> Found v0.2.1.tar.gz
==> Validating source files with sha256sums...
    v0.2.1.tar.gz ... Passed
==> Removing existing $srcdir/ directory...
==> Extracting sources...
  -> Extracting v0.2.1.tar.gz with bsdtar
==> Sources are ready.
==> Making package: guile-gcrypt 0.2.1-1 (mar. 11 août 2020 10:26:02)
==> Checking runtime dependencies...
==> Checking buildtime dependencies...
==> WARNING: Using existing $srcdir/ tree
==> Removing existing $pkgdir/ directory...
==> Starting build()...
autoreconf: Entering directory `.'
autoreconf: configure.ac: not using Gettext
autoreconf: running: aclocal --force
autoreconf: configure.ac: tracing
autoreconf: configure.ac: not using Libtool
autoreconf: running: /usr/bin/autoconf --force
autoreconf: configure.ac: not using Autoheader
autoreconf: running: automake --add-missing --copy --force-missing
configure.ac:7: installing 'build-aux/install-sh'
configure.ac:7: installing 'build-aux/missing'
Makefile.am: installing './INSTALL'
Makefile.am:95: installing 'build-aux/mdate-sh'
Makefile.am:95: installing 'build-aux/texinfo.tex'
autoreconf: Leaving directory `.'
checking for a BSD-compatible install... /usr/bin/install -c
checking whether build environment is sane... yes
checking for a thread-safe mkdir -p... /usr/bin/mkdir -p
checking for gawk... gawk
checking whether make sets $(MAKE)... yes
checking whether make supports nested variables... yes
checking whether make supports nested variables... (cached) yes
checking for pkg-config... /usr/bin/pkg-config
checking pkg-config is at least version 0.9.0... yes
configure: checking for guile 3.0
configure: checking for guile 2.2
configure: found guile 2.2
checking for guile... /usr/bin/guile
checking for Guile version >= 2.2... 2.2.6
checking for guild... /usr/bin/guild
checking for guile-config... /usr/bin/guile-config
checking for libgcrypt-config... /usr/bin/libgcrypt-config
checking libgcrypt's library directory...
checking for libgcrypt shared library name... libgcrypt
checking whether libgcrypt can be dynamically loaded... yes
checking that generated files are newer than configure... done
configure: creating ./config.status
config.status: creating Makefile
config.status: creating gcrypt/package-config.scm
config.status: creating pre-inst-env
Updating ./version.texi
  MAKEINFO guile-gcrypt.info
  GEN      gcrypt/base16.go
wrote `gcrypt/base16.go'
  GEN      gcrypt/base64.go
wrote `gcrypt/base64.go'
  GEN      gcrypt/common.go
;;; note: source file /home/eloi/.cache/yay/guile-gcrypt/src/guile-gcrypt/gcrypt/package-config.scm
;;;       newer than compiled /usr/lib/guile/2.2/site-ccache/gcrypt/package-config.go
Backtrace:
In system/base/target.scm:
     57:6 19 (with-target _ _)
In system/base/compile.scm:
    152:6 18 (compile-file _ #:output-file _ #:from _ #:to _ #:env _ ?)
     43:4 17 (call-once _)
In ice-9/boot-9.scm:
    841:4 16 (with-throw-handler _ _ _)
In system/base/compile.scm:
    59:11 15 (_)
   155:11 14 (_ #<closed: file 7f5e3d5611c0>)
   235:18 13 (read-and-compile #<input: gcrypt/common.scm 13> #:from ?)
   183:32 12 (compile-fold (#<procedure compile-tree-il (x e opts)>) ?)
In ice-9/boot-9.scm:
   2312:4 11 (save-module-excursion #<procedure 7f5e3d172d60 at lang?>)
In language/scheme/compile-tree-il.scm:
    31:15 10 (_)
In ice-9/psyntax.scm:
  1262:36  9 (expand-top-sequence ((define-module (gcrypt #) # # ?)) ?)
  1209:24  8 (parse _ (("placeholder" placeholder)) ((top) #(# # ?)) ?)
   285:10  7 (parse _ (("placeholder" placeholder)) (()) _ c&e (# #) #)
In ice-9/eval.scm:
   293:34  6 (_ #<module (#{ g77}#) 7f5e3d5660a0>)
In ice-9/boot-9.scm:
   2874:4  5 (define-module* _ #:filename _ #:pure _ #:version _ # _ ?)
  2071:24  4 (call-with-deferred-observers #<procedure 7f5e3e6da190 ?>)
   2891:7  3 (_)
   260:13  2 (for-each #<procedure 7f5e3cafb0c0 at ice-9/boot-9.scm?> ?)
In unknown file:
           1 (scm-error misc-error #f "~A ~S" ("Undefined variab?" ?) ?)
In ice-9/boot-9.scm:
   752:25  0 (dispatch-exception _ _ _)

ice-9/boot-9.scm:752:25: In procedure dispatch-exception:
Undefined variable: gcrypt-version
make: *** [Makefile:1422: gcrypt/common.go] Error 1
==> ERROR: A failure occurred in build().
    Aborting...
error making: %!s(func() string=0x5647a2d07bb0)