Package Details: gwyddion 2.47-1

Git Clone URL: https://aur.archlinux.org/gwyddion.git (read-only)
Package Base: gwyddion
Description: A data visualization and processing tool for scanning probe miscroscopy (SPM, i.e. AFM, STM, MFM, SNOM/NSOM, ...) and profilometry, useful also for general image and 2D data analysis
Upstream URL: http://gwyddion.net/
Licenses: GPL
Submitter: sirocco
Maintainer: sirocco
Last Packager: sirocco
Votes: 15
Popularity: 0.007878
First Submitted: 2008-11-30 12:29
Last Updated: 2016-11-29 11:36

Dependencies (17)

Required by (1)

Sources (1)

Latest Comments

linux-ka commented on 2014-09-26 09:22

Could you please add the current patch to v2.38

http://gwyddion.net/download/2.38/gwyddion-2.38-stat-tool-save-crash.patch

it might be irrelevant in v2.39

cebner commented on 2014-08-10 17:12

No problem installing with --without-perl added to configure.

Still don't get why it doesn't work with perl. Maybe I'm missing some dependencies?

Anyway, thanks for the help!

sirocco commented on 2014-08-10 14:04

The package is built without problems for me.
Try to add --without-perl to configure.

cebner commented on 2014-08-05 18:15

Ok, thanks for the info. Here the English version of the output:

for i in Gwyddion::dump.3pm; do \
/usr/bin/install -c -m 644 $i /tmp/yaourt-tmp/aur-gwyddion/pkg/gwyddion/usr/share/man/man3; \
done
/usr/bin/install: cannot stat ‘Gwyddion::dump.3pm’: No such file or directory
Makefile:620: recipe for target 'install-data-local' failed
make[2]: *** [install-data-local] Error 1
make[2]: Leaving directory '/tmp/yaourt-tmp/aur-gwyddion/src/gwyddion-2.37/perl'
Makefile:501: recipe for target 'install-am' failed
make[1]: *** [install-am] Error 2
make[1]: Leaving directory '/tmp/yaourt-tmp/aur-gwyddion/src/gwyddion-2.37/perl'
Makefile:592: recipe for target 'install-recursive' failed
make: *** [install-recursive] Error 1

sirocco commented on 2014-08-05 13:45

Please run
LANG=C yaourt -S gwyddion
to get error on English

cebner commented on 2014-08-05 08:20

Build error:

/usr/bin/mkdir -p /tmp/yaourt-tmp/aur-gwyddion/pkg/gwyddion/usr/share/man/man3
for i in Gwyddion::dump.3pm; do \
/usr/bin/install -c -m 644 $i /tmp/yaourt-tmp/aur-gwyddion/pkg/gwyddion/usr/share/man/man3; \
done
/usr/bin/install: der Aufruf von stat für „Gwyddion::dump.3pm“ ist nicht möglich: Datei oder Verzeichnis nicht gefunden
Makefile:620: recipe for target 'install-data-local' failed

sirocco commented on 2013-08-26 11:44

Version 2.31-2 with patch.

sirocco commented on 2013-08-26 11:04

Verion 2.31-2 with patch.

nemezis007 commented on 2013-08-20 18:18

It looks like there is a bulild issue due to perl problems:

POD document had syntax errors at /usr/bin/core_perl/pod2man line 71.

any idea how to solve it?

nemezis007 commented on 2013-08-20 15:06

It looks like there is a bulild issue due to perl problems:

POD document had syntax errors at /usr/bin/core_perl/pod2man line 71.

any idea how to solve it?

All comments