Package Details: gxneur 0.20.0-2

Git Clone URL: https://aur.archlinux.org/gxneur.git (read-only, click to copy)
Package Base: gxneur
Description: GTK frontend for XNeur
Upstream URL: http://www.xneur.ru
Licenses: GPL
Submitter: None
Maintainer: cucullus
Last Packager: cucullus
Votes: 71
Popularity: 0.27
First Submitted: 2006-11-15 21:39 (UTC)
Last Updated: 2017-04-09 14:15 (UTC)

Latest Comments

dmitriy commented on 2019-03-20 11:28 (UTC)

For those of you willing to build the package (v0.20.0-2), use this:

In PKGBUILD's build() section, after cd & before ./configure, add:

   # Patch from issue #30, fixes the build
   # https://github.com/AndrewCrewKuznetsov/xneur-devel/pull/30/commits/12f60288f9f84a144c30eb15d4ee9a5830e18a7c
   sed -i '82s/.*/G_DEFINE_TYPE_WITH_CODE (GtkTrayIcon, gtk_tray_icon, GTK_TYPE_PLUG, G_ADD_PRIVATE (GtkTrayIcon))/' src/tray_widget.c
   sed -i '107,108d' src/tray_widget.c

Either way, it doesn't run for me, mostly dying with:

realloc(): invalid old size
zsh: abort (core dumped)  gxneur

Circle111 commented on 2019-03-05 04:35 (UTC)

Короче не собирается. Ошибка иконки в трее. Да и хрен с ней. Без нее бы собрать. http://paste.org.ru/?pvdpqc

RusWolf commented on 2019-02-26 16:28 (UTC) (edited on 2019-02-26 16:29 (UTC) by RusWolf)

             from tray_widget.c:22:

/usr/include/glib-2.0/gobject/gtype.h:1303:10: замечание: объявлено здесь void g_type_class_add_private (gpointer g_class, ^~~~~~~~~~~~~~~~~~~~~~~~ cc1: все предупреждения считаются ошибками make[2]: [Makefile:549: gxneur-tray_widget.o] Ошибка 1 make[2]: Ожидание завершения заданий… make[2]: выход из каталога «/home/wolf/Общедоступные/gxneur/src/gxneur-0.20.0/src» make[1]: [Makefile:567: all-recursive] Ошибка 1 make[1]: выход из каталога «/home/wolf/Общедоступные/gxneur/src/gxneur-0.20.0» make: [Makefile:433: all] Ошибка 2 ==> ОШИБКА: Произошел сбой в build().

chapa commented on 2018-02-19 11:50 (UTC)

Don`t make pkg in Manjaro 17.1.5 x64. Error in build. Sadly.

Genues commented on 2017-12-04 07:57 (UTC) (edited on 2017-12-04 09:19 (UTC) by Genues)

Hi! After last update, i have a problem with run xneur and gxneur: gxneur: error while loading shared libraries: libenchant.so.1: cannot open shared object file: No such file or directory

UPD. It solved this problem: ln -s /usr/lib/libenchant.so.2.1.2 /usr/lib/libenchant.so.1

Genues commented on 2016-06-15 21:04 (UTC) (edited on 2016-06-16 05:55 (UTC) by Genues)

Thanks! It solved this problem, but now lost tray icon in Xfce. Upd. Not solved - http://pastebin.com/raw/Hsdf4LAw Upd2. On other my PC gxneur was updated and work fine. I look for the cause on first PC.

cucullus commented on 2016-06-15 20:32 (UTC)

gxneur should be built after new xneur installed

Genues commented on 2016-06-15 18:29 (UTC) (edited on 2016-06-15 18:30 (UTC) by Genues)

Houston, we have a problem $ gxneur gxneur: error while loading shared libraries: libxnconfig.so.17: cannot open shared object file: No such file or directory $ yaourt libxnconfig $

AlexWayfer commented on 2016-05-27 07:43 (UTC)

@bitnax, thanks! It's working.

bitnax commented on 2016-05-18 17:02 (UTC)

I got successful build only when I put the next line in PKGBUILD before "./configure ..." line: CPPFLAGS="-Wno-misleading-indentation -Wno-unused-variable"

cobalt commented on 2012-11-21 10:16 (UTC)

I figured this out. To fix this problem one has to add --with-gtk=gtk2 to ./configure options in the PKGBUILD for xneur (note, not gxneur) package.

stmc commented on 2012-11-20 21:55 (UTC)

same problem (gxneur:13328): Gtk-ERROR **: GTK+ 2.x symbols detected. Using GTK+ 2.x and GTK+ 3 in the same process is not supported

Genues commented on 2012-11-20 19:23 (UTC)

I have error on run: (gxneur:708): Gtk-ERROR **: GTK+ 2.x symbols detected. Using GTK+ 2.x and GTK+ 3 in the same process is not supported P.S. Spasibo za ves'ma poleznuyu programmu!!! :)

commented on 2012-11-10 09:32 (UTC)

0.16 is out. http://xneur.ru/news

VVS commented on 2012-07-11 08:10 (UTC)

2Petrovich: spasibo! :)

commented on 2012-07-11 06:50 (UTC)

fix in PKGBUILD: # Contributor: Sergey Kolesov <cucullus.at.mail.ru> # Previously contributed by StormBlast and Vyazovoi pkgname=gxneur pkgver=0.15.0 pkgrel=1 pkgdesc="GTK frontend for XNeur" url="http://www.xneur.ru" arch=('i686' 'x86_64') license=('GPL') depends=('libglade' "xneur>=${pkgver}" 'hicolor-icon-theme' 'gconf') source=("http://dists.xneur.ru/release-$pkgver/tgz/${pkgname}-${pkgver}.tar.bz2") install=${pkgname}.install md5sums=('ed749a4230339f28f42ae6dd28b762ab') build() { cd $startdir/src/${pkgname}-${pkgver} sed -i 's/-Werror //' configure ./configure --prefix=/usr make make DESTDIR=${startdir}/pkg install }

VVS commented on 2012-05-23 07:43 (UTC)

callbacks.c: В функции «on_key_press_event»: callbacks.c:351:2: ошибка: «XKeycodeToKeysym» is deprecated (declared at /usr/include/X11/Xlib.h:1695) [-Werror=deprecated-declarations] cc1: all warnings being treated as errors make[2]: *** [gxneur-callbacks.o] Ошибка 1 make[2]: Выход из каталога `/tmp/yaourt-tmp-root/aur-gxneur/src/gxneur-0.15.0/src' make[1]: *** [all-recursive] Ошибка 1 make[1]: Выход из каталога `/tmp/yaourt-tmp-root/aur-gxneur/src/gxneur-0.15.0' make: *** [all] Ошибка 2 ==> ОШИБКА: Произошел сбой в build(). Преждевременный выход... ==> ERROR: Makepkg was unable to build gxneur.

commented on 2012-05-21 17:45 (UTC)

When will the new version be released?

Aspiring commented on 2012-04-27 14:09 (UTC)

"gxneur: error while loading shared libraries: libpcre.so.0: cannot open shared object file: No such file or directory" >>> #cd /usr/lib/ #cp libpcre.so libpcre.so.0 Enjoy!

Aspiring commented on 2012-04-27 14:02 (UTC)

"gxneur: error while loading shared libraries: libpcre.so.0: cannot open shared object file: No such file or directory" >>> #cd /usr/lib/ #cp libpcre.so libpcre.so.0 Enjoy!

commented on 2012-03-20 18:49 (UTC)

But you maybe could make a bugfix release? I'm installing with yaourt, and when i edit the Makefile and try again, the archive unpacks again and the Make overrites...

cucullus commented on 2012-03-20 14:25 (UTC)

Ask devs about new versions. To fix compilation errors try to delete -Wall or something like that in CFLAGS (in Makefile)

commented on 2012-03-20 11:42 (UTC)

OK, when will it arrive? When wiil be the compile bug fixed?

cucullus commented on 2012-03-19 15:08 (UTC)

Dmitry, please do not flag until new version arrives.

commented on 2012-03-17 16:38 (UTC)

event.c: In function 'event_get_cur_keysym': event.c:144:2: error: 'XKeycodeToKeysym' is deprecated (declared at /usr/include/X11/Xlib.h:1695) [-Werror=deprecated-declarations] cc1: all warnings being treated as errors make[3]: *** [libxnmain_la-event.lo] Ошибка 1 make[3]: Выход из каталога `/tmp/yaourt-tmp-dmitry/aur-xneur/src/xneur-0.15.0/lib/main' make[2]: *** [all-recursive] Ошибка 1 make[2]: Выход из каталога `/tmp/yaourt-tmp-dmitry/aur-xneur/src/xneur-0.15.0/lib' make[1]: *** [all-recursive] Ошибка 1 make[1]: Выход из каталога `/tmp/yaourt-tmp-dmitry/aur-xneur/src/xneur-0.15.0' make: *** [all] Ошибка 2 ==> ОШИБКА: Произошел сбой в build(). Преждевременный выход... ==> ERROR: Makepkg was unable to build xneur.

VVS commented on 2012-03-03 17:21 (UTC)

gxneur: error while loading shared libraries: libpcre.so.0: cannot open shared object file: No such file or directory

VVS commented on 2012-03-03 17:16 (UTC)

gxneur: error while loading shared libraries: libpcre.so.0: cannot open shared object file: No such file or directory

commented on 2012-02-22 03:21 (UTC)

Quick fix to compile vs. libx11 1.4.99.1 https://gist.github.com/1881050

commented on 2011-11-16 08:43 (UTC)

New version was released