Package Details: i3-git 4.18.r82.g831a52de-1

Git Clone URL: https://aur.archlinux.org/i3-git.git (read-only, click to copy)
Package Base: i3-git
Description: An improved dynamic tiling window manager
Upstream URL: http://i3wm.org/
Licenses: BSD
Groups: i3-vcs
Conflicts: i3-wm, i3bar, i3bar-git
Provides: i3-wm
Submitter: Atsutane
Maintainer: badboy (Airblader)
Last Packager: Airblader
Votes: 73
Popularity: 0.000026
First Submitted: 2009-03-13 22:17
Last Updated: 2020-05-06 07:21

Required by (37)

Sources (1)

Latest Comments

1 2 3 4 5 6 ... Next › Last »

orestisf commented on 2020-05-05 16:27

We just pushed some fixes to i3. For everyone that had problems with -j builds, you can try again now.

orestisf commented on 2020-05-05 12:10

I don't see why bison & flex where re-added as a build dependency here

matejdro commented on 2020-04-15 11:02

I can confirm that my error below is resolved with -j1 workaround mentioned by @NeoRider below.

Airblader commented on 2020-04-15 06:34

Can you please open an issue upstream at https://github.com/i3/i3?

NeoRaider commented on 2020-04-14 17:37

I get various different build errors with the latest version. It seems there is an issue with parallel builds, the build works when I add -j1 to make.

Airblader commented on 2020-04-14 06:14

@matejdro The package still builds fine for me with the current HEAD.

Airblader commented on 2020-04-14 06:14

@matejdro The package still builds fine for me with the current HEAD.

matejdro commented on 2020-04-13 04:15

Build seems to with the 831a52de9abae1837077ef544e9c3ce52b5d2848

Preparing...
Cloning i3-git build files...
Checking i3-git dependencies...
Resolving dependencies...
Checking inter-conflicts...

Building i3-git...
==> Making package: i3-git 4.18.r82.g831a52de-1 (pon 13 apr 2020 06:08:11)
==> Checking runtime dependencies...
==> Checking buildtime dependencies...
==> Retrieving sources...
  -> Updating i3 git repo...
Fetching origin
From git://github.com/i3/i3
 + 89842881...8cc3bf2b refs/pull/3545/merge -> refs/pull/3545/merge  (forced update)
 + d307324a...eac1d1c6 refs/pull/3963/merge -> refs/pull/3963/merge  (forced update)
 + ccbd6aeb...acbfb710 refs/pull/3969/merge -> refs/pull/3969/merge  (forced update)
==> Validating source files with sha1sums...
    i3 ... Skipped
==> Removing existing $srcdir/ directory...
==> Extracting sources...
  -> Creating working copy of i3 git repo...
Cloning into 'i3'...
done.
==> Starting pkgver()...
==> Removing existing $pkgdir/ directory...
==> Starting build()...
configure.ac:140: installing './ar-lib'
configure.ac:60: installing './compile'
configure.ac:7: installing './config.guess'
configure.ac:7: installing './config.sub'
configure.ac:8: installing './install-sh'
configure.ac:8: installing './missing'
Makefile.am:38: warning: shell echo i3status | sed '@program_transform_name@': non-POSIX variable name
Makefile.am:38: (probably a GNU make extension)
Makefile.am:238: warning: '%'-style pattern rules are a GNU make extension
Makefile.am: installing './depcomp'
parallel-tests: installing './test-driver'
checking build system type... x86_64-pc-linux-gnu
checking host system type... x86_64-pc-linux-gnu
checking target system type... x86_64-pc-linux-gnu
checking for gsed... sed
checking for a BSD-compatible install... /usr/bin/install -c
checking whether build environment is sane... yes
checking for a thread-safe mkdir -p... /usr/bin/mkdir -p
checking for gawk... gawk
checking whether make sets $(MAKE)... yes
checking whether make supports nested variables... yes
checking whether make supports nested variables... (cached) yes
checking whether to enable maintainer-specific portions of Makefiles... yes
checking for gawk... (cached) gawk
checking for GNU make... make
checking for a sed that does not truncate output... /usr/bin/sed
checking whether to build with code coverage support... no
checking whether to enable debugging... yes
checking whether make supports the include directive... yes (GNU style)
checking for gcc... gcc
checking whether the C compiler works... yes
checking for C compiler default output file name... a.out
checking for suffix of executables... 
checking whether we are cross compiling... no
checking for suffix of object files... o
checking whether we are using the GNU C compiler... yes
checking whether gcc accepts -g... yes
checking for gcc option to accept ISO C89... none needed
checking whether gcc understands -c and -o together... yes
checking dependency style of gcc... gcc3
checking for gcc option to accept ISO C99... none needed
checking how to run the C preprocessor... gcc -E
checking for grep that handles long lines and -e... /usr/bin/grep
checking for egrep... /usr/bin/grep -E
checking for ANSI C header files... yes
checking for sys/types.h... yes
checking for sys/stat.h... yes
checking for stdlib.h... yes
checking for string.h... yes
checking for memory.h... yes
checking for strings.h... yes
checking for inttypes.h... yes
checking for stdint.h... yes
checking for unistd.h... yes
checking minix/config.h usability... no
checking minix/config.h presence... no
checking for minix/config.h... no
checking whether it is safe to define __EXTENSIONS__... yes
checking for stdbool.h that conforms to C99... yes
checking for _Bool... yes
checking for mode_t... yes
checking for off_t... yes
checking for pid_t... yes
checking for size_t... yes
checking for ssize_t... yes
checking for pid_t... (cached) yes
checking vfork.h usability... no
checking vfork.h presence... no
checking for vfork.h... no
checking for fork... yes
checking for vfork... yes
checking for working fork... yes
checking for working vfork... (cached) yes
checking whether lstat correctly handles trailing slash... yes
checking for working strnlen... yes
checking for atexit... yes
checking for dup2... yes
checking for ftruncate... yes
checking for getcwd... yes
checking for gettimeofday... yes
checking for localtime_r... yes
checking for memchr... yes
checking for memset... yes
checking for mkdir... yes
checking for rmdir... yes
checking for setlocale... yes
checking for socket... yes
checking for strcasecmp... yes
checking for strchr... yes
checking for strdup... yes
checking for strerror... yes
checking for strncasecmp... yes
checking for strrchr... yes
checking for strspn... yes
checking for strstr... yes
checking for strtol... yes
checking for strtoul... yes
checking for mkdirp... no
checking for strndup... yes
checking for library containing floor... -lm
checking for library containing ev_run... -lev
checking for library containing shm_open... -lrt
checking whether gcc is Clang... no
checking whether pthreads work with -pthread... yes
checking for joinable pthread attribute... PTHREAD_CREATE_JOINABLE
checking whether more special flags are required for pthreads... no
checking for PTHREAD_PRIO_INHERIT... yes
checking for pkg-config... /usr/bin/pkg-config
checking pkg-config is at least version 0.9.0... yes
checking for LIBSN... yes
checking for XCB... yes
checking for XCB_UTIL... yes
checking for XCB_UTIL_CURSOR... yes
checking for XCB_UTIL_KEYSYMS... yes
checking for XCB_UTIL_WM... yes
checking for XCB_UTIL_XRM... yes
checking for XKBCOMMON... yes
checking for YAJL... yes
checking for LIBPCRE... yes
checking for PANGOCAIRO... yes
checking for GLIBGOBJECT... yes
checking for gawk... (cached) gawk
checking how to run the C preprocessor... gcc -E
checking whether make sets $(MAKE)... (cached) yes
checking for ranlib... ranlib
checking whether ln -s works... yes
checking for asciidoc... /usr/bin/asciidoc
checking for xmlto... /usr/bin/xmlto
checking for pod2man... /usr/bin/core_perl/pod2man
checking for ar... ar
checking the archiver (ar) interface... ar
checking CFLAGS for maximum warnings... -Wall
checking whether C compiler accepts -Wunused-value... yes
checking fcntl.h usability... yes
checking fcntl.h presence... yes
checking for fcntl.h... yes
checking float.h usability... yes
checking float.h presence... yes
checking for float.h... yes
checking for inttypes.h... (cached) yes
checking limits.h usability... yes
checking limits.h presence... yes
checking for limits.h... yes
checking locale.h usability... yes
checking locale.h presence... yes
checking for locale.h... yes
checking netinet/in.h usability... yes
checking netinet/in.h presence... yes
checking for netinet/in.h... yes
checking paths.h usability... yes
checking paths.h presence... yes
checking for paths.h... yes
checking stddef.h usability... yes
checking stddef.h presence... yes
checking for stddef.h... yes
checking for stdint.h... (cached) yes
checking for stdlib.h... (cached) yes
checking for string.h... (cached) yes
checking sys/param.h usability... yes
checking sys/param.h presence... yes
checking for sys/param.h... yes
checking sys/socket.h usability... yes
checking sys/socket.h presence... yes
checking for sys/socket.h... yes
checking sys/time.h usability... yes
checking sys/time.h presence... yes
checking for sys/time.h... yes
checking for unistd.h... (cached) yes
checking that generated files are newer than configure... done
configure: creating ./config.status
config.status: creating Makefile
config.status: creating testcases/lib/i3test.pm
config.status: creating man/asciidoc.conf
config.status: creating testcases/complete-run.pl
config.status: creating config.h
config.status: executing buildir commands
config.status: skipping top_srcdir/Makefile - not created
config.status: executing depfiles commands
--------------------------------------------------------------------------------
build configured:

  i3 version:             4.18-82-g831a52de (2020-04-12, branch "next")
  is release version:     no

  build manpages:         yes
  build docs:             yes
  enable debug flags:     yes
  code coverage:          no
  enabled sanitizers:     

To compile, run:

  cd /var/tmp/pamac-build-matej/i3-git/src/i3/build && make -j8
--------------------------------------------------------------------------------
make  all-am
make[1]: Entering directory '/var/tmp/pamac-build-matej/i3-git/src/i3/build'
  CC       src/i3-commands.o
  CC       src/i3-assignments.o
  CC       src/i3-bindings.o
  CC       src/i3-config.o
  CC       src/i3-click.o
  GEN      i3-command-parser.stamp
  CC       src/i3-con.o
  GEN      i3-config-parser.stamp
  CC       src/i3-config_directives.o
  CC       src/i3-drag.o
  CC       src/i3-display_version.o
  CC       src/i3-ewmh.o
  CC       src/i3-fake_outputs.o
  CC       src/i3-floating.o
  CC       src/i3-handlers.o
  CC       src/i3-ipc.o
  CC       src/i3-key_press.o
  CC       src/i3-load_layout.o
  CC       src/i3-log.o
  CC       src/i3-main.o
  CC       src/i3-manage.o
  CC       src/i3-match.o
  CC       src/i3-move.o
  CC       src/i3-output.o
  CC       src/i3-randr.o
  CC       src/i3-regex.o
  CC       src/i3-render.o
  CC       src/i3-resize.o
  CC       src/i3-restore_layout.o
  CC       src/i3-scratchpad.o
  CC       src/i3-sd-daemon.o
  CC       src/i3-sighandler.o
  CC       src/i3-startup.o
  CC       src/i3-sync.o
  CC       src/i3-tree.o
  CC       src/i3-util.o
  CC       src/i3-version.o
  CC       src/i3-window.o
  CC       src/i3-workspace.o
  CC       src/i3-x.o
  CC       src/i3-xcb.o
  CC       src/i3-xcursor.o
  CC       src/i3-xinerama.o
  CC       libi3/a-dpi.o
  CC       libi3/a-draw_util.o
  CC       libi3/a-fake_configure_notify.o
  CC       libi3/a-font.o
  CC       libi3/a-format_placeholders.o
  CC       libi3/a-g_utf8_make_valid.o
  CC       libi3/a-get_colorpixel.o
  CC       libi3/a-get_config_path.o
  CC       libi3/a-get_exe_path.o
  CC       libi3/a-get_mod_mask.o
  CC       libi3/a-get_process_filename.o
  CC       libi3/a-get_visualtype.o
  CC       libi3/a-ipc_connect.o
  CC       libi3/a-ipc_recv_message.o
  CC       libi3/a-ipc_send_message.o
  CC       libi3/a-is_debug_build.o
  CC       libi3/a-mkdirp.o
  CC       libi3/a-resolve_tilde.o
  CC       libi3/a-root_atom_contents.o
  CC       libi3/a-safewrappers.o
  CC       libi3/a-string.o
  CC       libi3/a-strndup.o
  CC       libi3/a-ucs2_conversion.o
  CC       i3bar/src/i3bar-child.o
  CC       i3bar/src/i3bar-config.o
  CC       i3bar/src/i3bar-ipc.o
  CC       i3bar/src/i3bar-main.o
  CC       i3bar/src/i3bar-mode.o
  CC       i3bar/src/i3bar-outputs.o
  CC       i3bar/src/i3bar-workspaces.o
  CC       i3bar/src/i3bar-xcb.o
  CC       i3-config-wizard/i3_config_wizard-main.o
  CC       i3bar/src/i3bar-parse_json_header.o
  CC       i3-dump-log/i3_dump_log-main.o
  CC       i3-input/i3_input-keysym2ucs.o
  CC       i3-input/i3_input-main.o
  CC       i3-msg/i3_msg-main.o
  CC       i3-nagbar/i3_nagbar-main.o
  GEN      man/i3.xml
  GEN      man/i3bar.xml
  GEN      man/i3-msg.xml
  GEN      man/i3-nagbar.xml
  GEN      man/i3-input.xml
  GEN      man/i3-config-wizard.xml
  GEN      man/i3-migrate-config-to-v4.xml
  GEN      man/i3-sensible-editor.xml
  GEN      man/i3-sensible-pager.xml
  GEN      man/i3-sensible-terminal.xml
  GEN      man/i3-dump-log.xml
  GEN      man/i3-dmenu-desktop.1
  GEN      man/i3-save-tree.1
  GEN      docs/debugging.html
  GEN      docs/lib-i3test.html
  GEN      docs/lib-i3test-test.html
  GEN      docs/hacking-howto.html
  GEN      docs/userguide.html
  GEN      docs/ipc.html
  GEN      docs/multi-monitor.html
  GEN      docs/wsbar.html
  GEN      docs/testsuite.html
  GEN      docs/i3bar-protocol.html
  GEN      docs/layout-saving.html
  GEN      etc/config
  GEN      etc/config.keycodes
  CC       src/i3-commands_parser.o
  CC       src/i3-config_parser.o
  AR       libi3.a
ar: `u' modifier ignored since `D' is the default (see `U')
  CCLD     i3-config-wizard/i3-config-wizard
  GEN      man/i3bar.1
  GEN      man/i3-input.1
  GEN      man/i3-nagbar.1
/usr/bin/ld: i3-config-wizard/i3_config_wizard-main.o: in function `push_string':
/usr/src/debug/i3/build/../../i3/i3-config-wizard/main.c:168: undefined reference to `sstrdup'
/usr/bin/ld: /usr/src/debug/i3/build/../../i3/i3-config-wizard/main.c:173: undefined reference to `sasprintf'
/usr/bin/ld: i3-config-wizard/i3_config_wizard-main.o: in function `next_state':
/usr/src/debug/i3/build/../../i3/i3-config-wizard/main.c:293: undefined reference to `sstrdup'
/usr/bin/ld: /usr/src/debug/i3/build/../../i3/i3-config-wizard/main.c:293: undefined reference to `sstrdup'
/usr/bin/ld: /usr/src/debug/i3/build/../../i3/i3-config-wizard/main.c:298: undefined reference to `sasprintf'
/usr/bin/ld: i3-config-wizard/i3_config_wizard-main.o: in function `rewrite_binding':
/usr/src/debug/i3/build/../../i3/i3-config-wizard/main.c:405: undefined reference to `scalloc'
/usr/bin/ld: i3-config-wizard/i3_config_wizard-main.o: in function `txt':
/usr/src/debug/i3/build/../../i3/i3-config-wizard/main.c:475: undefined reference to `logical_px'
/usr/bin/ld: /usr/src/debug/i3/build/../../i3/i3-config-wizard/main.c:476: undefined reference to `logical_px'
/usr/bin/ld: /usr/src/debug/i3/build/../../i3/i3-config-wizard/main.c:477: undefined reference to `i3string_from_utf8'
/usr/bin/ld: /usr/src/debug/i3/build/../../i3/i3-config-wizard/main.c:478: undefined reference to `logical_px'
/usr/bin/ld: /usr/src/debug/i3/build/../../i3/i3-config-wizard/main.c:478: undefined reference to `logical_px'
/usr/bin/ld: /usr/src/debug/i3/build/../../i3/i3-config-wizard/main.c:478: undefined reference to `draw_util_text'
/usr/bin/ld: /usr/src/debug/i3/build/../../i3/i3-config-wizard/main.c:479: undefined reference to `i3string_free'
/usr/bin/ld: i3-config-wizard/i3_config_wizard-main.o: in function `handle_expose':
/usr/src/debug/i3/build/../../i3/i3-config-wizard/main.c:487: undefined reference to `draw_util_hex_to_color'
/usr/bin/ld: /usr/src/debug/i3/build/../../i3/i3-config-wizard/main.c:488: undefined reference to `draw_util_hex_to_color'
/usr/bin/ld: /usr/src/debug/i3/build/../../i3/i3-config-wizard/main.c:489: undefined reference to `draw_util_hex_to_color'
/usr/bin/ld: /usr/src/debug/i3/build/../../i3/i3-config-wizard/main.c:490: undefined reference to `draw_util_hex_to_color'
/usr/bin/ld: /usr/src/debug/i3/build/../../i3/i3-config-wizard/main.c:493: undefined reference to `draw_util_clear_surface'
/usr/bin/ld: /usr/src/debug/i3/build/../../i3/i3-config-wizard/main.c:495: undefined reference to `set_font'
/usr/bin/ld: /usr/src/debug/i3/build/../../i3/i3-config-wizard/main.c:502: undefined reference to `sasprintf'
/usr/bin/ld: /usr/src/debug/i3/build/../../i3/i3-config-wizard/main.c:529: undefined reference to `set_font'
/usr/bin/ld: /usr/src/debug/i3/build/../../i3/i3-config-wizard/main.c:535: undefined reference to `set_font'
/usr/bin/ld: i3-config-wizard/i3_config_wizard-main.o: in function `handle_button_press':
/usr/src/debug/i3/build/../../i3/i3-config-wizard/main.c:627: undefined reference to `logical_px'
/usr/bin/ld: /usr/src/debug/i3/build/../../i3/i3-config-wizard/main.c:627: undefined reference to `logical_px'
/usr/bin/ld: /usr/src/debug/i3/build/../../i3/i3-config-wizard/main.c:630: undefined reference to `logical_px'
/usr/bin/ld: /usr/src/debug/i3/build/../../i3/i3-config-wizard/main.c:630: undefined reference to `logical_px'
/usr/bin/ld: /usr/src/debug/i3/build/../../i3/i3-config-wizard/main.c:635: undefined reference to `logical_px'
/usr/bin/ld: i3-config-wizard/i3_config_wizard-main.o:/usr/src/debug/i3/build/../../i3/i3-config-wizard/main.c:635: more undefined references to `logical_px' follow
/usr/bin/ld: i3-config-wizard/i3_config_wizard-main.o: in function `finish':
/usr/src/debug/i3/build/../../i3/i3-config-wizard/main.c:739: undefined reference to `ipc_connect'
/usr/bin/ld: /usr/src/debug/i3/build/../../i3/i3-config-wizard/main.c:740: undefined reference to `ipc_send_message'
/usr/bin/ld: i3-config-wizard/i3_config_wizard-main.o: in function `main':
/usr/src/debug/i3/build/../../i3/i3-config-wizard/main.c:770: undefined reference to `sstrdup'
/usr/bin/ld: /usr/src/debug/i3/build/../../i3/i3-config-wizard/main.c:791: undefined reference to `get_config_path'
/usr/bin/ld: /usr/src/debug/i3/build/../../i3/i3-config-wizard/main.c:802: undefined reference to `resolve_tilde'
/usr/bin/ld: /usr/src/debug/i3/build/../../i3/i3-config-wizard/main.c:803: undefined reference to `sasprintf'
/usr/bin/ld: /usr/src/debug/i3/build/../../i3/i3-config-wizard/main.c:808: undefined reference to `sasprintf'
/usr/bin/ld: /usr/src/debug/i3/build/../../i3/i3-config-wizard/main.c:810: undefined reference to `mkdirp'
/usr/bin/ld: /usr/src/debug/i3/build/../../i3/i3-config-wizard/main.c:865: undefined reference to `get_mod_mask_for'
/usr/bin/ld: /usr/src/debug/i3/build/../../i3/i3-config-wizard/main.c:867: undefined reference to `init_dpi'
/usr/bin/ld: /usr/src/debug/i3/build/../../i3/i3-config-wizard/main.c:868: undefined reference to `load_font'
/usr/bin/ld: /usr/src/debug/i3/build/../../i3/i3-config-wizard/main.c:869: undefined reference to `load_font'
/usr/bin/ld: /usr/src/debug/i3/build/../../i3/i3-config-wizard/main.c:872: undefined reference to `set_font'
/usr/bin/ld: /usr/src/debug/i3/build/../../i3/i3-config-wizard/main.c:873: undefined reference to `i3string_from_utf8'
/usr/bin/ld: /usr/src/debug/i3/build/../../i3/i3-config-wizard/main.c:873: undefined reference to `predict_text_width'
/usr/bin/ld: /usr/src/debug/i3/build/../../i3/i3-config-wizard/main.c:882: undefined reference to `logical_px'
/usr/bin/ld: /usr/src/debug/i3/build/../../i3/i3-config-wizard/main.c:882: undefined reference to `logical_px'
/usr/bin/ld: /usr/src/debug/i3/build/../../i3/i3-config-wizard/main.c:882: undefined reference to `logical_px'
/usr/bin/ld: /usr/src/debug/i3/build/../../i3/i3-config-wizard/main.c:882: undefined reference to `logical_px'
/usr/bin/ld: /usr/src/debug/i3/build/../../i3/i3-config-wizard/main.c:932: undefined reference to `logical_px'
/usr/bin/ld: i3-config-wizard/i3_config_wizard-main.o:/usr/src/debug/i3/build/../../i3/i3-config-wizard/main.c:932: more undefined references to `logical_px' follow
/usr/bin/ld: i3-config-wizard/i3_config_wizard-main.o: in function `main':
/usr/src/debug/i3/build/../../i3/i3-config-wizard/main.c:932: undefined reference to `get_visualtype'
/usr/bin/ld: /usr/src/debug/i3/build/../../i3/i3-config-wizard/main.c:932: undefined reference to `draw_util_surface_init'
/usr/bin/ld: /usr/src/debug/i3/build/../../i3/i3-config-wizard/main.c:995: undefined reference to `draw_util_surface_free'
collect2: error: ld returned 1 exit status
make[1]: *** [Makefile:1606: i3-config-wizard/i3-config-wizard] Error 1
make[1]: *** Waiting for unfinished jobs....
Note: Writing i3bar.1
Note: Writing i3-nagbar.1
Note: Writing i3-input.1
make[1]: Leaving directory '/var/tmp/pamac-build-matej/i3-git/src/i3/build'
make: *** [Makefile:1336: all] Error 2
==> ERROR: A failure occurred in build().
    Aborting...

badboy commented on 2017-01-23 09:43

@Airblader: Will do so, feel free to take over the packages (though I don't see the need to update git packages…)

Airblader commented on 2017-01-23 07:46

@badboy Would you consider orphaning the packages i3-git, i3status-git and i3lock-git? I'd like to update the versions for releases and important bug fixes or features so that we can push the update to users more actively and thus hopefully get quicker feedback.