Package Details: iceweasel 47.0.deb1-1

Git Clone URL: https://aur.archlinux.org/iceweasel.git (read-only)
Package Base: iceweasel
Description: Debian Browser based on Mozilla Firefox, with Parabola GNU/Linux-libre branding
Upstream URL: https://wiki.debian.org/it/Iceweasel
Licenses: GPL, MPL, LGPL
Provides: iceweasel=47.0
Submitter: superlex
Maintainer: superlex
Last Packager: superlex
Votes: 43
Popularity: 0.772585
First Submitted: 2013-02-22 13:36
Last Updated: 2016-06-10 15:41

Dependencies (38)

Required by (93)

Sources (12)

Latest Comments

prazola commented on 2016-06-15 18:32

make[6]: Leaving directory '/mk/iceweasel/src/firefox-47.0/moz-objdir/debian/branding'
composite -compose src-over -gravity center -geometry +0-26 ../iceweasel_logo.png /mk/iceweasel/src/firefox-47.0/debian/branding/content/about-base.png - | \
convert - -define png:exclude-chunk=time +set date:create +set date:modify about.png
composite: magick/cache.c:1790: GetOpenCLEvents: Assertion `cache_info->opencl != (OpenCLCacheInfo *) NULL' failed.
convert: no decode delegate for this image format `' @ error/constitute.c/ReadImage/504.
convert: no images defined `about.png' @ error/convert.c/ConvertImageCommand/3257.
make[5]: *** [Makefile:30: about.png] Error 1
make[5]: Leaving directory '/mk/iceweasel/src/firefox-47.0/moz-objdir/debian/branding/content'
make[4]: *** [/mk/iceweasel/src/firefox-47.0/config/recurse.mk:79: debian/branding/content/libs] Error 2
make[4]: Leaving directory '/mk/iceweasel/src/firefox-47.0/moz-objdir'
make[3]: *** [/mk/iceweasel/src/firefox-47.0/config/recurse.mk:33: libs] Error 2
make[3]: Leaving directory '/mk/iceweasel/src/firefox-47.0/moz-objdir'
make[2]: *** [/mk/iceweasel/src/firefox-47.0/config/rules.mk:557: default] Error 2
make[2]: Leaving directory '/mk/iceweasel/src/firefox-47.0/moz-objdir'
make[1]: *** [/mk/iceweasel/src/firefox-47.0/client.mk:419: realbuild] Error 2
make[1]: Leaving directory '/mk/iceweasel/src/firefox-47.0'
make: *** [client.mk:181: build] Error 2

superlex commented on 2016-05-27 16:32

Hi AndrzejL,
same error with official firefox PKGBUILD.
Look at this
https://bugs.archlinux.org/task/49361

AndrzejL commented on 2016-05-26 18:46

Latest version fails to compile:

^
libdom_presentation.a.desc
rm -f libdom_presentation.a
/home/andrzejl/.yaourt/packages/yaourt-tmp-andrzejl/aur-iceweasel/src/firefox-46.0.1/moz-objdir/_virtualenv/bin/python /home/andrzejl/.yaourt/packages/yaourt-tmp-andrzejl/aur-iceweasel/src/firefox-46.0.1/config/expandlibs_gen.py -o libdom_presentation.a.desc Unified_cpp_dom_presentation0.o
make[5]: Leaving directory '/home/andrzejl/.yaourt/packages/yaourt-tmp-andrzejl/aur-iceweasel/src/firefox-46.0.1/moz-objdir/dom/presentation'
make[4]: Leaving directory '/home/andrzejl/.yaourt/packages/yaourt-tmp-andrzejl/aur-iceweasel/src/firefox-46.0.1/moz-objdir'
/home/andrzejl/.yaourt/packages/yaourt-tmp-andrzejl/aur-iceweasel/src/firefox-46.0.1/config/recurse.mk:32: recipe for target 'compile' failed
make[3]: *** [compile] Error 2
make[3]: Leaving directory '/home/andrzejl/.yaourt/packages/yaourt-tmp-andrzejl/aur-iceweasel/src/firefox-46.0.1/moz-objdir'
/home/andrzejl/.yaourt/packages/yaourt-tmp-andrzejl/aur-iceweasel/src/firefox-46.0.1/config/rules.mk:557: recipe for target 'default' failed
make[2]: *** [default] Error 2
make[2]: Leaving directory '/home/andrzejl/.yaourt/packages/yaourt-tmp-andrzejl/aur-iceweasel/src/firefox-46.0.1/moz-objdir'
/home/andrzejl/.yaourt/packages/yaourt-tmp-andrzejl/aur-iceweasel/src/firefox-46.0.1/client.mk:396: recipe for target 'realbuild' failed
make[1]: *** [realbuild] Error 2
make[1]: Leaving directory '/home/andrzejl/.yaourt/packages/yaourt-tmp-andrzejl/aur-iceweasel/src/firefox-46.0.1'
client.mk:171: recipe for target 'build' failed
make: *** [build] Error 2
==> ERROR: A failure occurred in build().
Aborting...
==> ERROR: Makepkg was unable to build iceweasel.
==> Restart building iceweasel ? [y/N]
==> ----------------------------------
==>
==> ERROR: unable to update
[andrzejl@x200 ~]$

Cheers.

Andrzej

HunabKu commented on 2016-05-24 09:59

Don't works anymore.

AndrzejL commented on 2016-04-02 20:32

Damn... Hoisted by my own alias... Never mind. Saul Goodman.

Cheers.

Andrzej

superlex commented on 2016-04-02 16:40

Hi AndrzejL,
my output is

[...]
looking for conflicting packages...
:: librsvg-stable and librsvg are in conflict. Remove librsvg? [y/N] y
Packages (2) librsvg-2:2.40.13-1 [removal] librsvg-stable-2:2.40.10-1
Total Installed Size: 0.54 MiB
Net Upgrade Size: 0.02 MiB
:: Proceed with installation? [Y/n]
(1/1) checking keys in keyring [######################] 100%
(1/1) checking package integrity [######################] 100%
(1/1) loading package files [######################] 100%
(1/1) checking for file conflicts [######################] 100%
(2/2) checking available disk space [######################] 100%
:: Processing package changes...
(1/1) removing librsvg [######################] 100%
(1/1) installing librsvg-stable [######################] 100%
[...]

librsvg-stable provides librsvg.

Be sure to answer y (yes) to the question
:: librsvg-stable and librsvg are in conflict. Remove librsvg? [y/N] y

AndrzejL commented on 2016-04-02 10:56

Making iceweasel dependant on librsvg is making things... complicated... to say the least.

==> Leaving fakeroot environment.
==> Finished making: librsvg-stable 2:2.40.10-1 (Sat Apr 2 11:28:31 IST 2016)
==> Cleaning up...

==> Continue installing librsvg-stable ? [Y/n]
==> [v]iew package contents [c]heck package with namcap
==> ---------------------------------------------------
==>
Swipe your finger across the fingerprint reader
Verification timed out
Password:
loading packages...
resolving dependencies...
looking for conflicting packages...
:: librsvg-stable and librsvg are in conflict. Remove librsvg? [y/N]
error: unresolvable package conflicts detected
error: failed to prepare transaction (conflicting dependencies)
:: librsvg-stable and librsvg are in conflict
==> WARNING: Your packages are saved in /tmp/yaourt-tmp-andrzejl
==> Restart building iceweasel ? [y/N]
==> ----------------------------------
==>
==> ERROR: unable to update
[andrzejl@x200 ~]$

And if I try to remove librsvg and replace it with librsvg-stable 3/4 of my system wants to go with it...

I think this needs to be re-thought...

Cheers.

Andrzej

superlex commented on 2016-04-01 18:18

@Emulatorman
Thanks for your suggestion (and thanks to your team).
I'll upload librsvg-stable on AUR.

Emulatorman commented on 2016-04-01 04:34

@supelex
We (Parabola hackers) are using librsvg-stable [0] to build iceweasel and packages that needs be built against it until librsvg be fixed. Also i put librsvg to provides array to avoid conflicts with another packages. You could consider it as temporary fix.

[0]:https://www.parabola.nu/packages/libre/x86_64/librsvg-stable/

superlex commented on 2016-03-20 17:36

@seva
There is a bug in librsvg:
https://bugs.archlinux.org/index.php?do=details&task_id=48599
Wait for fix.

superlex commented on 2016-03-15 20:10

Yes, I agree.
I think the best idea is to follow parabola team for now, in order to maintain iceweasel branding and the same version of firefox.
In the future we could create a different package on AUR, e.g. called debian-firefox.

WhiteKnight commented on 2016-03-15 17:56

I'm not sure, for what you guys use Iceweasel. My use case is to have a separate browser at my office computer for my private profile.

Iceweasel = private Firefox profile
Firefox = work Firefox profile

So, as long as I can start both browsers without problems, I'm happy with any solution. Besides … I would vote against ESR, because this means an aging browser over time. ;)

superlex commented on 2016-03-15 16:56

So guys, iceweasel will be deprecated in favour of firefox.
Firefox just arrived in Sid with version 45.0 and it will become default browser from next stable release of Debian, Stretch.
We could switch to iceweasel esr for now, adopt firefox with debian patches or adopt parabola gnu/linux iceweasel, with or without libre patches.

Let me konw what do you prefer.

Anonymous comment on 2016-03-08 07:33

I second prazola "Iceweasel icon is not scaled properly. I can se only a corner of the image in my launchers. ". I'm having the same issue right now.

prazola commented on 2016-01-18 02:53

Fixed, Ty!

superlex commented on 2016-01-17 18:08

Hi prazola, thanks for your feedback.
Just updated, try now.

prazola commented on 2016-01-15 17:57

Iceweasel icon is not scaled properly. I can se only a corner of the image in my launchers.

superlex commented on 2016-01-03 15:25

Sorry guys, I forgot to update md5 for mozconfig :P
I'll update it as soon as possible.

Happy New Year :)

ignace72 commented on 2016-01-02 10:41

Oops, sorry, I forget that everyone does not speak French.
To everyone, I wish you all a very good year in 2016.

AndrzejL commented on 2016-01-02 10:32

@Ignace72

Please run: export LC_ALL=C in the terminal and then re-run the command before reporting an error. This will change your language (in this particular terminal) to English.

And yes I can confirm - there is a problem with the mozconfig file's md5sum

==> Validating source files with md5sums...
iceweasel_43.0.2.orig.tar.xz ... Passed
iceweasel_43.0.2-1.debian.tar.xz ... Passed
mozconfig ... FAILED
iceweasel.desktop ... Passed
iceweasel-install-dir.patch ... Passed
vendor.js ... Passed
iceweasel-20.0.1-fixed-loading-icon.png ... Passed
==> ERROR: One or more files did not pass the validity check!
==> ERROR: Makepkg was unable to build iceweasel.
==> Restart building iceweasel ? [y/N]
==> ----------------------------------
==>
==> ERROR: unable to update

Cheers.

Andrzej

ignace72 commented on 2016-01-01 19:48

Hi,
There is a validation error with the mozconfig md5sums file.

==> Validation des fichiers sources avec md5sums...
iceweasel_43.0.2.orig.tar.xz ... Réussite
iceweasel_43.0.2-1.debian.tar.xz ... Réussite
mozconfig ... ÉCHEC
iceweasel.desktop ... Réussite
iceweasel-install-dir.patch ... Réussite
vendor.js ... Réussite
iceweasel-20.0.1-fixed-loading-icon.png ... Réussite
==> ERREUR : Un ou plusieurs fichiers sont invalides !

nlufr commented on 2015-11-21 09:58

it's work :-)

superlex commented on 2015-09-05 14:51

Hi Cyberpunk,
thanks for your suggestions :)
I updated PKGBUILD but I commented these strings for now.

For example, it seems "ac_add_options --enable-optimize" is enabled by default:
https://developer.mozilla.org/en/docs/Configuring_Build_Options

As regards mk_add_options MOZ_MAKE_FLAGS="-j2", it depends on number of CPU cores, but it's just set in makepkg.conf.

superlex commented on 2015-09-05 14:37

Hi Cyberpunk,
thanks for your suggestions :)
I updated PKGBUILD but I commented these strings for now.

For example, it seems "ac_add_options --enable-optimize" is enabled by default:
https://developer.mozilla.org/it/docs/Configuring_Build_Options

As regards mk_add_options MOZ_MAKE_FLAGS="-j2", it depends on number of CPU cores, but it's just set in makepkg.conf.

superlex commented on 2015-09-05 14:23

Hi Cyberpunk,
thanks for your suggestions :)
I updated PKGBUILD but I commented these strings for now.

FixedTorres commented on 2015-09-04 15:08

Hi @superlex

# Optimize
ac_add_options --enable-optimize

# Other
mk_add_options MOZ_MAKE_FLAGS="-j2"

Add for optimize the building of Iceweasel and using less CPU.

FixedTorres commented on 2015-09-04 15:06

Hi @superlex

# Optimize
ac_add_options --enable-optimize

# Other
mk_add_options MOZ_MAKE_FLAGS="-j2"

Add for optimize the building of Iceweasel. Using less CPU :D

belette commented on 2015-08-17 10:34

Cool Many thanks superflex!
Working now :-)

superlex commented on 2015-08-16 14:58

Ok belette, just updated :)

superlex commented on 2015-08-15 22:24

Hi belette, thanks for your feedback.
Tomorrow I investigate, try this workaround for now:

# cp -R "$pkgdir/usr/lib/$pkgname/browser/searchplugins" "$pkgdir/etc/${pkgname}/searchplugins/locale/en-US"

# rm -rv "$pkgdir/usr/lib/$pkgname/browser/searchplugins"

belette commented on 2015-08-15 18:03

Hi
I receive this message

cp: cannot stat '/tmp/iceweasel/pkg/iceweasel/usr/lib/iceweasel/browser/searchplugins': No such file or directory
==> ERROR: A failure occurred in package().
Aborting...

I saw on a very old thread that one user had the same issue but I got the same now... this plugin is not in Aur anymore :(

many thanks

superlex commented on 2015-07-09 12:22

I've successfully built iceweasel with this PKGBUILD :)

eNTi commented on 2015-07-09 09:51

i've successfully built firefox from the abs PKGBUILD.

eNTi commented on 2015-06-14 21:39

../../gfx/skia/SkFontHost_FreeType.o: In function `SkTypeface_FreeType::onGetAdvancedTypefaceMetrics(SkAdvancedTypefaceMetrics::PerGlyphInfo, unsigned int const*, unsigned int) const':
/tmp/makepkg/iceweasel/src/mozilla-release/gfx/skia/trunk/src/ports/SkFontHost_FreeType.cpp:560: undefined reference to `FT_Get_X11_Font_Format'
collect2: error: ld returned 1 exit status
/tmp/makepkg/iceweasel/src/mozilla-release/config/rules.mk:812: recipe for target 'libxul.so' failed
make[5]: *** [libxul.so] Error 1
make[5]: Leaving directory '/tmp/makepkg/iceweasel/src/mozilla-release/moz-objdir/toolkit/library'
/tmp/makepkg/iceweasel/src/mozilla-release/config/recurse.mk:74: recipe for target 'toolkit/library/target' failed
make[4]: *** [toolkit/library/target] Error 2
make[4]: Leaving directory '/tmp/makepkg/iceweasel/src/mozilla-release/moz-objdir'
/tmp/makepkg/iceweasel/src/mozilla-release/config/recurse.mk:36: recipe for target 'compile' failed
make[3]: *** [compile] Error 2
make[3]: Leaving directory '/tmp/makepkg/iceweasel/src/mozilla-release/moz-objdir'
/tmp/makepkg/iceweasel/src/mozilla-release/config/rules.mk:541: recipe for target 'default' failed
make[2]: *** [default] Error 2
make[2]: Leaving directory '/tmp/makepkg/iceweasel/src/mozilla-release/moz-objdir'
/tmp/makepkg/iceweasel/src/mozilla-release/client.mk:398: recipe for target 'realbuild' failed
make[1]: *** [realbuild] Error 2
make[1]: Leaving directory '/tmp/makepkg/iceweasel/src/mozilla-release'
client.mk:171: recipe for target 'build' failed
make: *** [build] Error 2


this seems to be related to the infinality-font issues reported here: https://aur.archlinux.org/packages/palemoon/

i've not yet tried to build firefox, but i will.

FixedTorres commented on 2015-05-28 12:00

New version iceweasel 38.0.1-5 :D

superlex commented on 2015-05-18 20:35

Thanks for the news Cyberpunk ;)

FixedTorres commented on 2015-05-17 14:25

@superlex

NSS 3.18.1-1 No longer in the repository testing!! :D
https://www.archlinux.org/packages/core/x86_64/nss/

FixedTorres commented on 2015-05-15 01:16

compile and install Iceweasel 38 properly with the nss dependence which is still in testing repositories ... it works perfectly, good job.

https://www.archlinux.org/packages/testing/x86_64/nss/

FixedTorres commented on 2015-05-14 22:27

After clearing cache I get an error in the build()
but it does not come out more information about the error and where it comes from.

superlex commented on 2015-05-14 21:35

@Cyberpunk
Clean your src directory and try again.

FixedTorres commented on 2015-05-14 20:38

I have the following error:

mv: can not move 'debian' to «/home/user/PKGBUILD/iceweasel/src/mozilla-release/debian»: The directory is not empty

==> ERROR: There was a failure to prepare ().
Aborting ...

FixedTorres commented on 2015-05-14 13:55

@superlex
Is this dependence is necessary?
https://www.archlinux.org/packages/core/x86_64/nss/

superlex commented on 2015-05-14 05:03

iceweasel 38
Please wait for nss>=3.18.1 before trying to build it.

FixedTorres commented on 2015-04-21 18:08

Please change the dependence so that no errors (icu==55.1 By icu) :D

superlex commented on 2015-04-21 17:42

@Cyberpunk
https://www.archlinux.org/packages/extra/x86_64/icu/download/
https://www.archlinux.org/packages/extra/i686/icu/download/

Version is 55.1 :)

FixedTorres commented on 2015-04-21 17:28

Can not find a dependency
Error: Target not found: icu=55.1

Try icu52
https://aur.archlinux.org/packages/icu52/

FixedTorres commented on 2015-04-21 17:25

Can not find a dependency
Error: Target not found: icu=55.1

superlex commented on 2015-04-21 16:52

No error for me building iceweasel 37.0.2.
Arch 3.14.38-1-lts #1 SMP Mon Apr 13 16:56:48 CEST 2015 i686 GNU/Linux

superlex commented on 2015-04-21 16:51

No errors for me building iceweasel 37.0.2.
Arch 3.14.38-1-lts #1 SMP Mon Apr 13 16:56:48 CEST 2015 i686 GNU/Linux

farmerdave commented on 2015-04-13 23:32

I've tried this on three different pc's/laptops, same error's in the same place. Possible that I consistently install Arch in an odd manner?

superlex commented on 2015-04-12 13:58

I changed this line:
make -f client.mk DESTDIR="$pkgdir" INSTALL_SDK= install

Please, try again.

farmerdave commented on 2015-04-12 03:41

Hi superlex,
I tried the new PKGBUILD but it seems to fail with the same errors.

superlex commented on 2015-04-11 12:52

Cairo disabled in mozconfig and iceweasel-install-dir.patch changed.
Try again and let me know.

farmerdave commented on 2015-04-11 10:05

I still get an error however.

Executing /home/david/Files/builds/tmpdir/iceweasel/src/mozilla-release/moz-objdir/dist/bin/xpcshell -g /home/david/Files/builds/tmpdir/iceweasel/src/mozilla-release/moz-objdir/dist/bin/ -a /home/david/Files/builds/tmpdir/iceweasel/src/mozilla-release/moz-objdir/dist/bin/ -f /home/david/Files/builds/tmpdir/iceweasel/src/mozilla-release/toolkit/mozapps/installer/precompile_cache.js -e precompile_startupcache("resource://gre/");
resource://gre/components/ActivityMessageConfigurator.js
...
resource://gre/components/Webapps.js
Traceback (most recent call last):
File "/home/david/Files/builds/tmpdir/iceweasel/src/mozilla-release/toolkit/mozapps/installer/packager.py", line 399, in <module>
main()
File "/home/david/Files/builds/tmpdir/iceweasel/src/mozilla-release/toolkit/mozapps/installer/packager.py", line 393, in main
args.source, gre_path, base)
File "/home/david/Files/builds/tmpdir/iceweasel/src/mozilla-release/toolkit/mozapps/installer/packager.py", line 156, in precompile_cache
errors.fatal('Error while running startup cache precompilation')
File "/home/david/Files/builds/tmpdir/iceweasel/src/mozilla-release/python/mozbuild/mozpack/errors.py", line 101, in fatal
self._handle(self.FATAL, msg)
File "/home/david/Files/builds/tmpdir/iceweasel/src/mozilla-release/python/mozbuild/mozpack/errors.py", line 96, in _handle
raise ErrorMessage(msg)
mozpack.errors.ErrorMessage: Error: Error while running startup cache precompilation
/home/david/Files/builds/tmpdir/iceweasel/src/mozilla-release/toolkit/mozapps/installer/packager.mk:36: recipe for target 'stage-package' failed
make[2]: *** [stage-package] Error 1
make[2]: Leaving directory '/home/david/Files/builds/tmpdir/iceweasel/src/mozilla-release/moz-objdir/browser/installer'
/home/david/Files/builds/tmpdir/iceweasel/src/mozilla-release/browser/build.mk:21: recipe for target 'install' failed
make[1]: *** [install] Error 2
make[1]: Leaving directory '/home/david/Files/builds/tmpdir/iceweasel/src/mozilla-release/moz-objdir'
client.mk:405: recipe for target 'install' failed
make: *** [install] Error 2
==> ERROR: A failure occurred in package().

farmerdave commented on 2015-04-10 22:48

You're right. Previous build failed, so directory wasn't cleaned!

superlex commented on 2015-04-09 16:05

@farmerdave
Is it your src directory clean?
Try rm -r src (in your iceweasel directory) before makepkg -s .

@Cyberpunk
" There was a failure in build () " is too generic.
Please add some other information about your error.

farmerdave commented on 2015-04-08 23:09

I get a build error also.

Extracting sources...
-> Extracting iceweasel_37.0.1.orig.tar.bz2 with bsdtar
-> Extracting iceweasel_37.0.1-1.debian.tar.xz with bsdtar
==> Starting prepare()...
mv: cannot move ‘debian’ to ‘home/david/builds/tmpdir/iceweasel/src/mozilla-release/debian’: Directory not empty
==> ERROR: A failure occurred in prepare().
Aborting...

FixedTorres commented on 2015-04-08 12:14

Superlex

I tried again, but still the same error, the installation is interrupted in the process of compilation. :(

superlex commented on 2015-04-05 14:32

Thanks for your feedback Cyberpunk.
Please, try again.

FixedTorres commented on 2015-04-04 22:56

Something wrong with this package, the installation is aborted with the following error:

==> ERROR: There was a failure in build ().
Cancelling ...
==> ERROR: unable to compile makepkg iceweasel.

czubek commented on 2015-02-14 21:03

Thank you superlex that worked.

superlex commented on 2015-02-13 19:47

Try with
tar -zxvf iceweasel.tar.gz

czubek commented on 2015-02-12 22:46

packer wouldn't install iceweasel. Downloaded tarball and got this error:

[chris@hpdv5k AUR]$ sudo tar -xvf iceweasel.tar.gz
tar: This does not look like a tar archive

gzip: stdin: unexpected end of file
tar: Child returned status 1
tar: Error is not recoverable: exiting now

Double checked base-devel and all xarchiver stuff installed. Am I doing something wrong?

superlex commented on 2014-11-15 22:19

Thanks WhiteKnight!
debian/duckduckgo.xml is no more present in this directory.
However debian/debsearch.xml yes.

superlex commented on 2014-11-15 22:19

Thanky you WhiteKnight!
debian/duckduckgo.xml is no more present in this directory.
However debian/debsearch.xml yes.

WhiteKnight commented on 2014-11-15 13:37

The following file is missing (or in the wrong place?) and produces an error:
src/mozilla-release/debian/duckduckgo.xml

I commented both search engines out, then the package was built successfully:
# install -Dm644 "$srcdir/$DEBIAN_BUILD/debian/duckduckgo.xml" "$pkgdir/etc/${pkgname}/searchplugins/common/duckduckgo.xml"
# install -Dm644 "$srcdir/$DEBIAN_BUILD/debian/debsearch.xml" "$pkgdir/etc/${pkgname}/searchplugins/common/debsearch.xml"

superlex commented on 2014-10-05 19:34

Yes, of course.
Thanks pnobel.

pnobel commented on 2014-10-05 18:35

Also add autoconf2.13 as a makedepend.

pnobel commented on 2014-10-05 18:09

You need to add quilt as a makedepend.

superlex commented on 2014-10-05 16:21

32.0.3.deb1-2 :
- rhbz-966424.patch added
- mozconfig updated
- dependes and makedepends section updated

superlex commented on 2014-10-05 16:21

32.0.3.deb1-2 :
- rhbz-966424.patch added
- mozconfig updated
- dependes and makedepends section updatded

WhiteKnight commented on 2014-08-22 11:39

For me it is working fine with yaourt since quite a few versions.

superlex commented on 2014-08-22 09:45

Don't use yaourt. Download the tarball and build the software with makepkg -s.
(I think yaourt doesn't support AUR 3.0)

superlex commented on 2014-08-22 09:45

Don't use yaourt. Download the tarball and build the software with makepkg -s.
(I think yaourt doesn't support AUR 3.0)

pierregermain commented on 2014-08-21 14:54

Installing this with "yaourt -S iceweasel" I get:
(...)
==> Retrieving sources ...
(...)
-> Downloading iceweasel_30.0-2.debian.tar.xz...
curl: (22) The requested URL returned error: 404 Not Found
==> ERROR: Failure while downloading iceweasel_30.0-2.debian.tar.xz
Aborting...
==> ERROR: Makepkg was unable to build iceweasel.
==> Restart building iceweasel ? [y/N]

errepunto commented on 2014-07-31 13:19

Hi, I'm trying to build this package for a armv7h architectura, but I have an error during configuration:

configure:17249: checking for gtk+-2.0 >= 2.10.0 gtk+-unix-print-2.0 glib-2.0 gobject-2.0 gdk-x11-2.0
configure: error: Library requirements (gtk+-2.0 >= 2.10.0 gtk+-unix-print-2.0 glib-2.0 gobject-2.0 gdk-x11-2.0) not met; consider adjusting the PKG_CONFIG_PATH environment variable if your libraries are in a nonstandard prefix so pkg-config can find them.
*** Fix above errors and then restart with\
"make -f client.mk build"
/tmp_yaourt/yaourt-tmp-ruben/aur-iceweasel/src/mozilla-release/client.mk:361: recipe for target 'configure' failed


Version parameters in PKGBUILD:
_debver=30.0
_debrel=2

fabienwang commented on 2014-05-23 07:06

Can i please adopt the package? i have the pkgbuild ready for 29.0.1

Dea993 commented on 2014-05-20 09:11

please update to 29.0.1

superlex commented on 2014-02-24 22:05

You're welcome :)
However thanks to iceweasel-libre team :)

WhiteKnight commented on 2014-02-24 17:40

It builds successfully now. Thank you very much, superlex! :)

superlex commented on 2014-02-24 15:42

Thanks WhiteKnight.
The problem is /src/mozilla-release/build/pgo/blueprint/valid.png
Release 2 fixed the issue?

WhiteKnight commented on 2014-02-24 14:37

Sorry to spam you … I cannot compile the current version. Is anybody else experiencing this problem? To be honest, I'm not really getting the cause of the problem out of this output.

make[5]: Entering directory '/yaourt-tmp-wk/aur-iceweasel/src/mozilla-release/moz-objdir/build'
/yaourt-tmp-wk/aur-iceweasel/src/mozilla-release/moz-objdir/config/nsinstall -R -m 644 "/yaourt-tmp-wk/aur-iceweasel/src/mozilla-release/.gdbinit" "../dist/bin"
/yaourt-tmp-wk/aur-iceweasel/src/mozilla-release/moz-objdir/_virtualenv/bin/python /yaourt-tmp-wk/aur-iceweasel/src/mozilla-release/config/Preprocessor.py \
-DBROWSER_PATH=\"../dist/bin/iceweasel-bin\" -DXPC_BIN_PATH=\"/yaourt-tmp-wk/aur-iceweasel/src/mozilla-release/moz-objdir/dist/bin\" -DBIN_SUFFIX=\"\" -DPROFILE_DIR=\"../_profile/pgo\" -DCERTS_SRC_DIR=\"/yaourt-tmp-wk/aur-iceweasel/src/mozilla-release/build/pgo/certs\" -DPERL="\"/usr/bin/perl\"" -DIS_MAC=0 -DIS_LINUX=1 -DIS_CAMINO=0 -DIS_TEST_BUILD=1 -DIS_DEBUG_BUILD=0 -DCRASHREPORTER=0 -DIS_ASAN=0 -DGRE_MILESTONE=27.0.1 -DAPP_BUILDID=20140224145644 -DMOZ_APP_VERSION="27.0.1" -DMOZ_APP_BASENAME="Iceweasel" -DMOZ_APP_VENDOR="Mozilla" -DMOZ_APP_ID="{ec8030f7-c20a-464f-9b0e-13a3a9e97384}" -DMAR_CHANNEL_ID="firefox-mozilla-release" -DACCEPTED_MAR_CHANNEL_IDS="firefox-mozilla-release" -DMOZ_BUILD_APP_IS_BROWSER -DMOZ_APP_PROFILE="mozilla/iceweasel" -DMOZ_PROFILE_MIGRATOR -DMOZ_EXTENSION_MANAGER -DMOZ_GLUE_IN_PROGRAM -DNO_NSPR_10_SUPPORT -DMOZ_APP_STATIC_INI -DHAVE_64BIT_OS=1 -DJSGC_INCREMENTAL=1 -DMOZ_ENABLE_PROFILER_SPS=1 -DMOZILLA_VERSION=\"27.0.1\" -DMOZILLA_VERSION_U=27.0.1 -DMOZILLA_UAVERSION=\"27.0\" -DXP_LINUX=1 -DD_INO=d_ino -DSTDC_HEADERS=1 -DHAVE_SSIZE_T=1 -DHAVE_ST_BLKSIZE=1 -DHAVE_SIGINFO_T=1 -DHAVE_VISIBILITY_HIDDEN_ATTRIBUTE=1 -DHAVE_VISIBILITY_ATTRIBUTE=1 -DHAVE_DIRENT_H=1 -DHAVE_GETOPT_H=1 -DHAVE_SYS_BITYPES_H=1 -DHAVE_MEMORY_H=1 -DHAVE_UNISTD_H=1 -DHAVE_GNU_LIBC_VERSION_H=1 -DHAVE_NL_TYPES_H=1 -DHAVE_MALLOC_H=1 -DHAVE_X11_XKBLIB_H=1 -DHAVE_CPUID_H=1 -DHAVE_SYS_QUOTA_H=1 -DHAVE_SYS_SYSMACROS_H=1 -DHAVE_LINUX_QUOTA_H=1 -DHAVE_LINUX_IF_ADDR_H=1 -DHAVE_LINUX_RTNETLINK_H=1 -DHAVE_SYS_TYPES_H=1 -DHAVE_NETINET_IN_H=1 -DHAVE_BYTESWAP_H=1 -DHAVE_SYS_CDEFS_H=1 -DHAVE_DLOPEN=1 -DHAVE_DLADDR=1 -DHAVE_MEMMEM=1 -DFUNCPROTO=15 -DHAVE_LIBXSS=1 -D_REENTRANT=1 -DHAVE_RANDOM=1 -DHAVE_STRERROR=1 -DHAVE_LCHOWN=1 -DHAVE_FCHMOD=1 -DHAVE_SNPRINTF=1 -DHAVE_MEMMOVE=1 -DHAVE_STAT64=1 -DHAVE_LSTAT64=1 -DHAVE_TRUNCATE64=1 -DHAVE_SETBUF=1 -DHAVE_ISATTY=1 -DHAVE_FLOCKFILE=1 -DHAVE_LOCALTIME_R=1 -DHAVE_STRTOK_R=1 -DHAVE_CLOCK_MONOTONIC=1 -DHAVE_RES_NINIT=1 -DHAVE_LANGINFO_CODESET=1 -DVA_COPY=va_copy -DHAVE_VA_COPY=1 -DHAVE_VA_LIST_AS_ARRAY=1 -DHAVE_THREAD_TLS_KEYWORD=1 -DMALLOC_H=\<malloc.h\> -DHAVE_STRNDUP=1 -DHAVE_POSIX_MEMALIGN=1 -DHAVE_MEMALIGN=1 -DHAVE_VALLOC=1 -DHAVE_MALLOC_USABLE_SIZE=1 -DHAVE_I18N_LC_MESSAGES=1 -DHAVE_LOCALECONV=1 -DNS_ATTR_MALLOC=__attribute__\(\(malloc\)\) -DNS_WARN_UNUSED_RESULT=__attribute__\(\(warn_unused_result\)\) -DRELEASE_BUILD=1 -DHAVE_LIBPNG=1 -DMOZ_UPDATE_CHANNEL=default -DMOZ_PHOENIX=1 -DMOZ_BUILD_APP=browser -DMOZ_X11=1 -DMOZ_WIDGET_GTK2=1 -DMOZ_WIDGET_GTK=2 -DMOZ_PDF_PRINTING=1 -DMOZ_ENABLE_XREMOTE=1 -DMOZ_INSTRUMENT_EVENT_LOOP=1 -DMOZ_ENABLE_STARTUP_NOTIFICATION=1 -DMOZ_X11=1 -DMOZ_DISTRIBUTION_ID=\"org.mozilla\" -DMOZ_PANGO=1 -DMOZ_ENABLE_GIO=1 -DMOZ_ENABLE_GCONF=1 -DMOZ_ENABLE_DBUS=1 -DIBMBIDI=1 -DACCESSIBILITY=1 -DNS_PRINTING=1 -DNS_PRINT_PREVIEW=1 -DMOZ_WEBRTC=1 -DMOZ_WEBRTC_ASSERT_ALWAYS=1 -DMOZ_WEBRTC_SIGNALING=1 -DMOZ_PEERCONNECTION=1 -DMOZ_SCTP=1 -DMOZ_SRTP=1 -DMOZ_SAMPLE_TYPE_FLOAT32=1 -DMOZ_WEBSPEECH=1 -DMOZ_RAW=1 -DMOZ_OGG=1 -DATTRIBUTE_ALIGNED_MAX=64 -DMOZ_WEBM=1 -DMOZ_MEDIA_NAVIGATOR=1 -DMOZ_VP8=1 -DMOZ_VP8_ERROR_CONCEALMENT=1 -DMOZ_VP8_ENCODER=1 -DHAVE_LIBVPX=1 -DMOZ_WAVE=1 -DMOZ_SPEEX_RESAMPLER=1 -DMOZ_SOUNDTOUCH=1 -DMOZ_CUBEB=1 -DMOZ_VORBIS=1 -DMOZ_OPUS=1 -DMOZ_CUBEB=1 -DMOZ_CUBEB=1 -DMOZ_GSTREAMER=1 -DENABLE_SYSTEM_EXTENSION_DIRS=1 -DMOZ_WEBGL=1 -DMOZ_WEBGL_CONFORMANT=1 -DMOZ_GAMEPAD=1 -DMOZ_CRASHREPORTER_ENABLE_PERCENT=100 -DMOZ_WEBAPP_RUNTIME=1 -DMOZ_ENABLE_GTEST=1 -DGTEST_HAS_RTTI=0 -DMOZ_FEEDS=1 -DMOZ_NATIVE_SQLITE=1 -DMOZ_SAFE_BROWSING=1 -DMOZ_URL_CLASSIFIER=1 -DGL_PROVIDER_GLX=1 -DMOZ_LOGGING=1 -DMOZ_MEMORY=1 -DMOZ_MEMORY_LINUX=1 -DJSGC_INCREMENTAL=1 -DMOZ_PAY=1 -DHAVE___CXA_DEMANGLE=1 -DHAVE__UNWIND_BACKTRACE=1 -DJS_DEFAULT_JITREPORT_GRANULARITY=3 -DMOZ_OMNIJAR=1 -DMOZ_USER_DIR=\".mozilla\" -DMOZ_STATIC_JS=1 -DHAVE_FT_BITMAP_SIZE_Y_PPEM=1 -DHAVE_FT_GLYPHSLOT_EMBOLDEN=1 -DHAVE_FT_LOAD_SFNT_TABLE=1 -DHAVE_FT_SELECT_SIZE=1 -DHAVE_FONTCONFIG_FCFREETYPE_H=1 -DHAVE_STDINT_H=1 -DHAVE_INTTYPES_H=1 -DMOZ_TREE_CAIRO=1 -DHAVE_UINT64_T=1 -DMOZ_ENABLE_SKIA=1 -DUSE_SKIA=1 -DUSE_SKIA_GPU=1 -DMOZ_XUL=1 -DMOZ_PROFILELOCKING=1 -DBUILD_CTYPES=1 -DMOZ_PLACES=1 -DMOZ_SOCIAL=1 -DMOZ_SERVICES_COMMON=1 -DMOZ_SERVICES_CRYPTO=1 -DMOZ_SERVICES_METRICS=1 -DMOZ_SERVICES_SYNC=1 -DMOZ_JSDOWNLOADS=1 -DMOZ_MACBUNDLE_ID=org.mozilla.iceweasel -DMOZ_B2G_VERSION=\"1.0.0\" -DMOZ_B2G_OS_NAME=\"\" -DMOZ_APP_UA_NAME=\"\" -DMOZ_APP_UA_VERSION=\"27.0.1\" -DFIREFOX_VERSION=27.0.1 -DMOZ_TELEMETRY_DISPLAY_REV=2 -DMOZ_DLL_SUFFIX=\".so\" -DHAVE_POSIX_FALLOCATE=1 -DXP_UNIX=1 -DMOZ_ACCESSIBILITY_ATK=1 -DATK_MAJOR_VERSION=2 -DATK_MINOR_VERSION=10 -DATK_REV_VERSION=0 /yaourt-tmp-wk/aur-iceweasel/src/mozilla-release/build/automation.py.in > automation.py
/yaourt-tmp-wk/aur-iceweasel/src/mozilla-release/moz-objdir/_virtualenv/bin/python /yaourt-tmp-wk/aur-iceweasel/src/mozilla-release/config/Preprocessor.py /yaourt-tmp-wk/aur-iceweasel/src/mozilla-release/build/leaktest.py.in > leaktest.py
make[5]: *** No rule to make target '/yaourt-tmp-wk/aur-iceweasel/src/mozilla-release/build/pgo/blueprint/valid.png'. Schluss.
make[5]: *** Warte auf noch nicht beendete Prozesse...
chmod +x leaktest.py
make[5]: Leaving directory '/yaourt-tmp-wk/aur-iceweasel/src/mozilla-release/moz-objdir/build'
/yaourt-tmp-wk/aur-iceweasel/src/mozilla-release/config/recurse.mk:99: recipe for target 'build/libs' failed
make[4]: *** [build/libs] Error 2
make[4]: Leaving directory '/yaourt-tmp-wk/aur-iceweasel/src/mozilla-release/moz-objdir'
/yaourt-tmp-wk/aur-iceweasel/src/mozilla-release/config/recurse.mk:39: recipe for target 'libs' failed
make[3]: *** [libs] Error 2
make[3]: Leaving directory '/yaourt-tmp-wk/aur-iceweasel/src/mozilla-release/moz-objdir'
/yaourt-tmp-wk/aur-iceweasel/src/mozilla-release/config/rules.mk:643: recipe for target 'default' failed
make[2]: *** [default] Error 2
make[2]: Leaving directory '/yaourt-tmp-wk/aur-iceweasel/src/mozilla-release/moz-objdir'
/yaourt-tmp-wk/aur-iceweasel/src/mozilla-release/client.mk:394: recipe for target 'realbuild' failed
make[1]: *** [realbuild] Error 2
make[1]: Leaving directory '/yaourt-tmp-wk/aur-iceweasel/src/mozilla-release'
client.mk:179: recipe for target 'build' failed
make: *** [build] Error 2

superlex commented on 2013-09-25 21:54

@eazar001
No, or no more :)

eazar001 commented on 2013-07-26 05:02

anyone notice huge memory leaks and random crashes with iceweasel?

superlex commented on 2013-05-21 14:39

iceweasel 21.0.deb1-2 : fixed locale config.

superlex commented on 2013-05-14 16:47

"erreur d'écriture"

Do you have enough free space?
I suggest you to download the archive and build it in a partition where there are almost 4GB free.

brizou commented on 2013-05-12 23:46

problem compiling
here's what I have with yaourt
/tmp/yaourt-tmp-clement/aur-iceweasel/src/mozilla-release/moz-objdir/config/nsinstall -R -m 644 "_xpidlgen/nsIX509CertDB.h" "../../../../dist/include"
/tmp/yaourt-tmp-clement/aur-iceweasel/src/mozilla-release/moz-objdir/config/nsinstall -R -m 644 "_xpidlgen/nsIX509CertValidity.h" "../../../../dist/include"
/tmp/yaourt-tmp-clement/aur-iceweasel/src/mozilla-release/moz-objdir/config/nsinstall -R -m 644 "_xpidlgen/nsINSSVersion.h" "../../../../dist/include"
make[7] : on quitte le répertoire « /tmp/yaourt-tmp-clement/aur-iceweasel/src/mozilla-release/moz-objdir/security/manager/ssl/public »
make[7]: erreur d'écriture
make[6]: *** [export] Erreur 1
make[6] : on quitte le répertoire « /tmp/yaourt-tmp-clement/aur-iceweasel/src/mozilla-release/moz-objdir/security/manager/ssl »
make[5]: *** [export] Erreur 2
make[5] : on quitte le répertoire « /tmp/yaourt-tmp-clement/aur-iceweasel/src/mozilla-release/moz-objdir/security/manager »
make[4]: *** [export_tier_platform] Erreur 2
make[4] : on quitte le répertoire « /tmp/yaourt-tmp-clement/aur-iceweasel/src/mozilla-release/moz-objdir »
make[3]: *** [tier_platform] Erreur 2
make[3] : on quitte le répertoire « /tmp/yaourt-tmp-clement/aur-iceweasel/src/mozilla-release/moz-objdir »
make[2]: *** [default] Erreur 2
make[2] : on quitte le répertoire « /tmp/yaourt-tmp-clement/aur-iceweasel/src/mozilla-release/moz-objdir »
make[1]: *** [realbuild] Erreur 2
make[1] : on quitte le répertoire « /tmp/yaourt-tmp-clement/aur-iceweasel/src/mozilla-release »
make: *** [build] Erreur 2

superlex commented on 2013-02-22 15:13

Features:

* It saves user profile in .mozilla/iceweasel, comment if you prefer ./mozilla/firefox
* It installs debsearch.xml, comment if you don't want it.