Package Details: icinga2 2.10.4-1

Git Clone URL: https://aur.archlinux.org/icinga2.git (read-only)
Package Base: icinga2
Description: An open source host, service and network monitoring program
Upstream URL: http://www.icinga.org
Licenses: GPL
Replaces: icinga2-common
Submitter: bebehei
Maintainer: julianbrost
Last Packager: julianbrost
Votes: 31
Popularity: 0.609323
First Submitted: 2014-06-23 01:10
Last Updated: 2019-04-20 14:12

Required by (2)

Sources (3)

Latest Comments

« First ‹ Previous 1 2 3 4 5 6 7 8 9 10 11 Next › Last »

dkaea353 commented on 2016-06-08 20:09

Can't compile on Raspberry Pi 2 (armv7h), Boost 1.60.0-5:

[ 39%] Linking CXX executable ../Bin/Release/icinga2
../Bin/Release/libcli.so: undefined reference to `boost::re_detail_106000::cpp_regex_traits_implementation<char>::transform_primary(char const*, char const*) const'
../Bin/Release/libcli.so: undefined reference to `boost::re_detail_106000::cpp_regex_traits_implementation<char>::transform(char const*, char const*) const'
collect2: error: ld returned 1 exit status
distcc[10066] ERROR: compile (null) on localhost failed
icinga-app/CMakeFiles/icinga-app.dir/build.make:120: recipe for target 'Bin/Release/icinga2' failed
make[2]: *** [Bin/Release/icinga2] Error 1
CMakeFiles/Makefile2:2227: recipe for target 'icinga-app/CMakeFiles/icinga-app.dir/all' failed
make[1]: *** [icinga-app/CMakeFiles/icinga-app.dir/all] Error 2
make[1]: *** Waiting for unfinished jobs....
[ 59%] Built target icinga
Makefile:160: recipe for target 'all' failed
make: *** [all] Error 2
==> ERROR: A failure occurred in build().
Aborting...

bebehei commented on 2016-06-02 00:55

I've seen, since 2.4 there is also icinga2 studio [0] available. What about supporting this?

[0] https://www.icinga.org/2015/09/02/icinga-2-api-updates/#clients

Zearan commented on 2016-05-20 10:17

I would like to wait a few days before updating to make sure that there are no severe bugs in 2.4.10 like there were in 2.4.8 and 2.4.9.

Zearan commented on 2016-05-15 15:21

Please see https://bugs.archlinux.org/task/49248, boost 1.60.0-4 will fail.
@bebehei: Thank you for your quick answers and solutions. =)

bebehei commented on 2016-05-15 11:43

@MCL: Cannot reproduce with boost/boost-libs 1.60.0-5. PKGBUILD works like a charm. This bug may be either introduced by Arch-maintainer of boost or by icinga2 devs.

But anyway: Please use LANG=C for your output before pasting it. Just because the maintainers are german and are able to understand it, is no reason to paste it in german.

WRMSR commented on 2016-05-14 11:25

Hi,

can't compile this with boost 1.60.0-4:

[ 95%] Linking CXX executable ../Bin/Release/icinga2
../Bin/Release/libcli.so: undefined reference to `boost::re_detail_106000::cpp_regex_traits_implementation<char>::transform[abi:cxx11](char const*, char const*) const'
../Bin/Release/libcli.so: undefined reference to `boost::re_detail_106000::cpp_regex_traits_implementation<char>::transform_primary[abi:cxx11](char const*, char const*) const'
collect2: Fehler: ld gab 1 als Ende-Status zurück
icinga-app/CMakeFiles/icinga-app.dir/build.make:120: die Regel für Ziel „Bin/Release/icinga2“ scheiterte
make[2]: *** [Bin/Release/icinga2] Fehler 1
CMakeFiles/Makefile2:2294: die Regel für Ziel „icinga-app/CMakeFiles/icinga-app.dir/all“ scheiterte
make[1]: *** [icinga-app/CMakeFiles/icinga-app.dir/all] Fehler 2
Makefile:160: die Regel für Ziel „all“ scheiterte
make: *** [all] Fehler 2
==> FEHLER: Ein Fehler geschah in build().
Breche ab...
==> FEHLER:Makepkg konnte icinga2 nicht erstellen.
==> Erstellen von icinga2 neu starten?[j/N]

Trying to compile the icinga2-git version fails also.

disprofarma commented on 2016-04-28 04:13

Hi, yajl is listed in depends= and makedepends=. Thanks.

bebehei commented on 2016-04-07 23:02

@valleedelisle: Read through the wiki's PKGBUILD arch section [0]. There had been also a discussion somewhere else, which elaborated these arguments and also applied them to the AUR.

There is also in makepkg: -A, --ignorearch

My personal opinion: Do you really want to push the pkgrel variable with the result of showing up on every persons AUR package-manager just for supporting a new architecture? Have a look at [1] and I found this annoying. This was just a small package, but what about a big one like this?

[0] https://wiki.archlinux.org/index.php/PKGBUILD#arch
[1] https://aur.archlinux.org/cgit/aur.git/diff/?h=package-query&id=47f9d99a1c42dcb50ed596725f6801807f6b3b0b&id2=699633619773f1373df8e721bd8448413ade5305

valleedelisle commented on 2016-04-07 21:16

works perfectly fine on my rasberry pi 3, just make sur you have a swap file and you add armv7h to the PKGBUILD file.

therisen06 commented on 2016-03-03 11:42

I cannot reproduce the problem with 2.4.3 (the problem might still occur at times if it's some kind of race condition). gcc 5.3.0 crashed while compiling 2.4.1 with "-j4" ("internal compiler error"). Just a heads up for anyone running into the same problem. As for "Please do not set settings that do not work on your system": No kidding...