Package Details: iio-sensor-proxy-git 3.3.r28.e4f0e05-1

Git Clone URL: https://aur.archlinux.org/iio-sensor-proxy-git.git (read-only, click to copy)
Package Base: iio-sensor-proxy-git
Description: IIO accelerometer sensor to input device proxy
Upstream URL: https://gitlab.freedesktop.org/hadess/iio-sensor-proxy
Licenses: GPL2
Conflicts: iio-sensor-proxy
Provides: iio-sensor-proxy
Submitter: ultraviolet
Maintainer: robertfoster
Last Packager: robertfoster
Votes: 4
Popularity: 0.000000
First Submitted: 2015-07-05 21:46 (UTC)
Last Updated: 2022-04-17 08:02 (UTC)

Latest Comments

RubenKelevra commented on 2022-04-15 21:00 (UTC)

Does not build due to missing dependencies:

==> Starting build()...
+ exec meson setup --prefix /usr --libexecdir lib --sbindir bin --buildtype plain --auto-features enabled --wrap-mode nodownload -D b_lto=true -D b_pie=true .. -Dsystemdsystemunitdir=/usr/lib/systemd/system -Dudevrulesdir=/usr/lib/udev/rules.d -Dsysconfdir=/usr/share
The Meson build system
Version: 0.62.0
Source dir: /build/iio-sensor-proxy-git/src/iio-sensor-proxy
Build dir: /build/iio-sensor-proxy-git/src/iio-sensor-proxy/build
Build type: native build
Project name: iio-sensor-proxy
Project version: 3.3
C compiler for the host machine: cc (gcc 11.2.0 "cc (GCC) 11.2.0")
C linker for the host machine: cc ld.bfd 2.38
Host machine cpu family: x86_64
Host machine cpu: x86_64
Compiler for C supports arguments -fgnu89-inline: YES 
Compiler for C supports arguments -fvisibility=hidden: YES 
Compiler for C supports arguments -std=gnu99: YES 
Compiler for C supports arguments -Wall: YES 
Compiler for C supports arguments -Wundef: YES 
Compiler for C supports arguments -Wunused: YES 
Compiler for C supports arguments -Wstrict-prototypes: YES 
Compiler for C supports arguments -Werror-implicit-function-declaration: YES 
Compiler for C supports arguments -Wno-pointer-sign: YES 
Compiler for C supports arguments -Wshadow: YES 
Library m found: YES
Found pkg-config: /usr/bin/pkg-config (1.8.0)
Run-time dependency gio-2.0 found: YES 2.72.0
Run-time dependency gudev-1.0 found: YES 237
Did not find CMake 'cmake'
Found CMake: NO
Run-time dependency polkit-gobject-1 found: NO (tried pkgconfig)

../meson.build:47:0: ERROR: Dependency "polkit-gobject-1" not found, tried pkgconfig

A full log can be found at /build/iio-sensor-proxy-git/src/iio-sensor-proxy/build/meson-logs/meson-log.txt
==> ERROR: A failure occurred in build().
    Aborting...
==> ERROR: Build failed, check /var/lib/paru/aur_chroot/rubenk/build
error: failed to build 'iio-sensor-proxy-git-3.3.r2.a7b6032-1': failed to run: makechrootpkg -r /var/lib/paru/aur_chroot -D /var/lib/paru/aur_chroot -d /var/cache/pacman/pkg/ -- -feA --noconfirm --noprepare --holdver: 
error: packages failed to build: iio-sensor-proxy-git-3.3.r2.a7b6032-1

hashworks commented on 2022-03-31 14:20 (UTC)

Had to add polkit as depends and dbus-python, python-psutil and umockdev as makedepends.

j.r commented on 2022-03-27 19:23 (UTC)

Seems like this package needs umockdev as dependency.

Sherlock commented on 2021-09-19 19:05 (UTC)

Getting an error downloading sources. Did the repo url change for this package?

LittleHuba commented on 2021-08-24 19:56 (UTC)

Sorry just saw that you only left the upstream URL at the old project. Also the version seems to be off?

freeeeeeeeeeee commented on 2020-07-15 22:59 (UTC)

Simply change the line arch-meson $_pkgname --reconfigure to arch-meson build $_pkgname

oddy commented on 2020-07-14 05:16 (UTC)

Directory does not contain a valid build tree

  • exec meson setup --prefix /usr --libexecdir lib --sbindir bin --buildtype plain --auto-features enabled --wrap-mode nodownload -D b_lto=true -D b_pie=true iio-sensor-proxy --reconfigure Directory does not contain a valid build tree: /home/dweller/.cache/yay/iio-sensor-proxy-git/src ==> ERROR: A failure occurred in build(). Aborting... Error making: iio-sensor-proxy-git

lviggiani commented on 2020-07-08 06:37 (UTC) (edited on 2020-07-08 06:37 (UTC) by lviggiani)

Hi, I'm getting the following error during build (using yay):

error making: %!s(func() string=0x5587f96bae80)

tasso commented on 2020-07-07 21:02 (UTC) (edited on 2020-07-07 21:04 (UTC) by tasso)

+1 - "Directory does not contain a valid build tree: [...]"

Sherlock commented on 2020-07-07 12:20 (UTC)

I am getting the same build error as Dani9oo

Dani9oo commented on 2020-07-02 23:43 (UTC)

Build failing right now

==> Starting build()... /home/user/.cache/yay/iio-sensor-proxy-git/PKGBUILD: line 25: ./autogen.sh: No such file or directory ==> ERROR: A failure occurred in build().

freeeeeeeeeeee commented on 2020-01-25 23:39 (UTC)

Upstream has changed to https://gitlab.freedesktop.org/hadess/iio-sensor-proxy/

parkerlreed commented on 2017-09-12 19:46 (UTC) (edited on 2017-09-12 19:47 (UTC) by parkerlreed)

:: no results found for libgudev>=232 (dependency tree: iio-sensor-proxy-git libgudev) EDIT: Oh the current package is out of date. At 231

aradan_d commented on 2017-04-17 14:41 (UTC)

I could install the package by doing `export WARN_CFLAGS="-Wno-unused-result -Wno-error=unused-result"` https://github.com/hadess/iio-sensor-proxy/issues/113

jwynn6 commented on 2017-04-11 15:23 (UTC)

The build is now failing for me. CC fake_input_accelerometer-fake-input-accelerometer.o fake-input-accelerometer.c: In function ‘send_uinput_event’: fake-input-accelerometer.c:90:2: error: ignoring return value of ‘write’, declared with attribute warn_unused_result [-Werror=unused-result] write (data->uinput, &ev, sizeof(ev)); ^~~~~~~~~~~~~~~~~~~~~~~~~~~~~~~~~~~~~ fake-input-accelerometer.c:94:2: error: ignoring return value of ‘write’, declared with attribute warn_unused_result [-Werror=unused-result] write (data->uinput, &ev, sizeof(ev)); ^~~~~~~~~~~~~~~~~~~~~~~~~~~~~~~~~~~~~ fake-input-accelerometer.c:98:2: error: ignoring return value of ‘write’, declared with attribute warn_unused_result [-Werror=unused-result] write (data->uinput, &ev, sizeof(ev)); ^~~~~~~~~~~~~~~~~~~~~~~~~~~~~~~~~~~~~ fake-input-accelerometer.c:104:2: error: ignoring return value of ‘write’, declared with attribute warn_unused_result [-Werror=unused-result] write (data->uinput, &ev, sizeof(ev)); ^~~~~~~~~~~~~~~~~~~~~~~~~~~~~~~~~~~~~ cc1: all warnings being treated as errors make[2]: *** [Makefile:624: fake_input_accelerometer-fake-input-accelerometer.o] Error 1 make[2]: Leaving directory '/home/justin/iio-sensor-proxy-git/src/iio-sensor-proxy/src' make[1]: *** [Makefile:434: all] Error 2 make[1]: Leaving directory '/home/justin/iio-sensor-proxy-git/src/iio-sensor-proxy/src' make: *** [Makefile:385: all-recursive] Error 1 ==> ERROR: A failure occurred in build(). Aborting...

fallenpixel commented on 2016-12-26 19:14 (UTC)

Package adopted, now builds properly.

fallenpixel commented on 2016-12-12 14:57 (UTC)

Can we please add GTK as a dependency?

fallenpixel commented on 2016-11-26 07:28 (UTC)

Compile is failing on multiple machines. \\\ ./configure: line 1854: syntax error near unexpected token `git-directory' ./configure: line 1854: `AX_IS_RELEASE(git-directory)' \\\

fallenpixel commented on 2016-05-26 12:50 (UTC)

Still would be nice to have the dependency added to the PKGBUILD

parkerlreed commented on 2016-04-18 03:24 (UTC)

KriK it literally tells you what you need sudo pacman -S gnome-common

KriK commented on 2015-07-09 07:50 (UTC)

Can't build: "which: no gnome-autogen.sh in (/usr/local/sbin:/usr/local/bin:/usr/bin:/usr/lib/jvm/default/bin:/usr/bin/site_perl:/usr/bin/vendor_perl:/usr/bin/core_perl) You need to install gnome-common from the GNOME git"