Package Details: iortcw-git 1.51b.r10.g0f779e8d-1

Git Clone URL: https://aur.archlinux.org/iortcw-git.git (read-only)
Package Base: iortcw-git
Description: Merge of ioquake3 features and fixes into Return to Castle Wolfenstein
Upstream URL: https://github.com/iortcw/iortcw
Licenses: GPL
Conflicts: iortcw-svn
Replaces: iortcw-svn
Submitter: M0Rf30
Maintainer: M0Rf30
Last Packager: M0Rf30
Votes: 10
Popularity: 0.000773
First Submitted: 2015-03-25 11:13
Last Updated: 2017-09-10 17:11

Latest Comments

Neros commented on 2017-08-25 10:53

I can't compile anymore:

```
In file included from code/client/cl_main.c:35:0:
code/client/../sys/sys_loadlib.h:42:12: fatal error: SDL.h: No such file or directory
# include <SDL.h>
^~~~~~~
compilation terminated.
make[2]: *** [Makefile:2502: build/release-linux-x86_64/client/cl_main.o] Error 1
make[2]: *** Waiting for unfinished jobs....
make[2]: Leaving directory '/tmp/yaourt-tmp-neros/aur-iortcw-git/src/iortcw/SP'
make[1]: *** [Makefile:1342: targets] Error 2
make[1]: Leaving directory '/tmp/yaourt-tmp-neros/aur-iortcw-git/src/iortcw/SP'
make: *** [Makefile:1260: release] Error 2
==> ERROR: A failure occurred in package().
Aborting...
==> ERROR: Makepkg was unable to build .
```

M0Rf30 commented on 2015-11-10 16:53

moved to iortcw-git.

mpz commented on 2015-11-08 23:45

build() blindly print "pak0.pk3 doesn't exist. This process will be terminated" and then:
==> Starting package()...
/tmp/iortcw-svn/PKGBUILD: line 38: cd: SP: No such file or directory
==> ERROR: A failure occurred in package().
Aborting...

mpz commented on 2015-11-08 23:14

==> ERROR: Cannot find the git package needed to handle git sources.

bebehei commented on 2014-12-29 15:13

Hi, I had to install the package openal to compile the package successfully. Could you please add this to the dependency-array?

Thanks.

Here is the error-message:

In file included from code/client/snd_openal.c:30:0:
code/client/qal.h:45:21: fatal error: AL/al.h: No such file or directory
#include <AL/al.h>
^
compilation terminated.
Makefile:2458: recipe for target 'build/release-linux-x86_64/client/snd_openal.o' failed
make[2]: *** [build/release-linux-x86_64/client/snd_openal.o] Error 1