Package Details: iridium 58.0-2

Git Clone URL: https://aur.archlinux.org/iridium.git (read-only)
Package Base: iridium
Description: a free, open, and libre browser modification of the Chromium code base
Upstream URL: https://iridiumbrowser.de/
Keywords: browser chromium web
Licenses: BSD
Conflicts: chromium
Replaces: chromium
Submitter: mytbk
Maintainer: mytbk
Last Packager: mytbk
Votes: 24
Popularity: 0.493197
First Submitted: 2015-12-10 15:41
Last Updated: 2017-05-01 02:39

Dependencies (36)

Required by (0)

Sources (6)

Latest Comments

notaspampeanas commented on 2017-07-08 14:23

mytbk: Many thanks for building, packaging, submitting and mantaining this package! Its really useful!
I'm a 'dummie beginner' with Archlinux - I'm user of Manjaro - and I've founded quite a solution for building Iridium in my computer here: https://wiki.manjaro.org/index.php/Arch_User_Repository
Hope this can help others!

kozaki commented on 2017-05-28 14:16

Thank you for maintaining this pkg mytbk.
However build fails here on my Arch i686 chroot with 5 GB /tmp space, it seems earlier than errors reported below:

make: Leaving directory '/tmp/arch32/iridium/src/chromium-launcher-3'
Building gn manually in a temporary directory for bootstrapping...
ninja: Entering directory `/tmp/arch32/iridium/src/temp/tmpLSBTI4'
[179/348] CXX base/files/file_enumerator_posix.o
/tmp/arch32/iridium/src/iridium-browser-58.0/base/files/file_enumerator_posix.cc: In static member function ‘static bool base::FileEnumerator::ReadDirectory(std::vector<base::FileEnumerator::FileInfo>*, const base::FilePath&, bool)’:
/tmp/arch32/iridium/src/iridium-browser-58.0/base/files/file_enumerator_posix.cc:136:10: warning: ‘int readdir_r(DIR*, dirent*, dirent**)’ is deprecated [-Wdeprecated-declarations]
while (readdir_r(dir, &dent_buf, &dent) == 0 && dent) {
^~~~~~~~~
In file included from /usr/include/features.h:410:0,
from /usr/include/bits/libc-header-start.h:33,
from /usr/include/stdint.h:26,
from /usr/lib/gcc/i686-pc-linux-gnu/6.3.1/include/stdint.h:9,
from /tmp/arch32/iridium/src/iridium-browser-58.0/base/files/file_enumerator.h:9,
from /tmp/arch32/iridium/src/iridium-browser-58.0/base/files/file_enumerator_posix.cc:5:
/usr/include/dirent.h:189:12: note: declared here
extern int __REDIRECT (readdir_r,
^
/tmp/arch32/iridium/src/iridium-browser-58.0/base/files/file_enumerator_posix.cc:136:41: warning: ‘int readdir_r(DIR*, dirent*, dirent**)’ is deprecated [-Wdeprecated-declarations]
while (readdir_r(dir, &dent_buf, &dent) == 0 && dent) {
^
In file included from /usr/include/features.h:410:0,
from /usr/include/bits/libc-header-start.h:33,
from /usr/include/stdint.h:26,
from /usr/lib/gcc/i686-pc-linux-gnu/6.3.1/include/stdint.h:9,
from /tmp/arch32/iridium/src/iridium-browser-58.0/base/files/file_enumerator.h:9,
from /tmp/arch32/iridium/src/iridium-browser-58.0/base/files/file_enumerator_posix.cc:5:
/usr/include/dirent.h:189:12: note: declared here
extern int __REDIRECT (readdir_r,
^
At global scope:
cc1plus: warning: unrecognized command line option ‘-Wno-c++11-narrowing’
[348/348] LINK gn
Building gn using itself to out/Release...
Done. Made 5244 targets from 1214 files in 3941ms
ninja: Entering directory `/tmp/arch32/iridium/src/iridium-browser-58.0/out/Release'
[1/495] CXX obj/base/base_paths/base_paths_posix.o
FAILED: obj/base/base_paths/base_paths_posix.o
g++ -MMD -MF obj/base/base_paths/base_paths_posix.o.d -DV8_DEPRECATION_WARNINGS -DUSE_UDEV -DUI_COMPOSITOR_IMAGE_TRANSPORT -DUSE_AURA=1 -DUSE_PANGO=1 -DUSE_CAIRO=1 -DUSE_GLIB=1 -DUSE_NSS_CERTS=1 -DUSE_X11=1 -DDISABLE_NACL -DFULL_SAFE_BROWSING -DSAFE_BROWSING_CSD -DSAFE_BROWSING_DB_LOCAL -DCHROMIUM_BUILD -DENABLE_MEDIA_ROUTER=1 -D_FILE_OFFSET_BITS=64 -D_LARGEFILE_SOURCE -D_LARGEFILE64_SOURCE -D__STDC_CONSTANT_MACROS -D__STDC_FORMAT_MACROS -D_FORTIFY_SOURCE=2 -DNDEBUG -DNVALGRIND -DDYNAMIC_ANNOTATIONS_ENABLED=0 -DBASE_IMPLEMENTATION -I../.. -Igen -fno-strict-aliasing --param=ssp-buffer-size=4 -fstack-protector -Wno-builtin-macro-redefined -D__DATE__= -D__TIME__= -D__TIMESTAMP__= -funwind-tables -fPIC -pipe -m64 -march=x86-64 -pthread -Wall -Wno-unused-local-typedefs -Wno-maybe-uninitialized -Wno-missing-field-initializers -Wno-unused-parameter -O2 -fno-ident -fdata-sections -ffunction-sections -g0 -fvisibility=hidden -fvisibility-inlines-hidden -std=gnu++11 -Wno-narrowing -fno-rtti -fno-exceptions -c ../../base/base_paths_posix.cc -o obj/base/base_paths/base_paths_posix.o
../../base/base_paths_posix.cc:1:0: sorry, unimplemented: 64-bit mode not compiled in
// Copyright (c) 2012 The Chromium Authors. All rights reserved.

[2/495] CXX obj/base/base_static/base_switches.o
FAILED: obj/base/base_static/base_switches.o
g++ -MMD -MF obj/base/base_static/base_switches.o.d -DV8_DEPRECATION_WARNINGS -DUSE_UDEV -DUI_COMPOSITOR_IMAGE_TRANSPORT -DUSE_AURA=1 -DUSE_PANGO=1 -DUSE_CAIRO=1 -DUSE_GLIB=1 -DUSE_NSS_CERTS=1 -DUSE_X11=1 -DDISABLE_NACL -DFULL_SAFE_BROWSING -DSAFE_BROWSING_CSD -DSAFE_BROWSING_DB_LOCAL -DCHROMIUM_BUILD -DENABLE_MEDIA_ROUTER=1 -D_FILE_OFFSET_BITS=64 -D_LARGEFILE_SOURCE -D_LARGEFILE64_SOURCE -D__STDC_CONSTANT_MACROS -D__STDC_FORMAT_MACROS -D_FORTIFY_SOURCE=2 -DNDEBUG -DNVALGRIND -DDYNAMIC_ANNOTATIONS_ENABLED=0 -I../.. -Igen -fno-strict-aliasing --param=ssp-buffer-size=4 -fstack-protector -Wno-builtin-macro-redefined -D__DATE__= -D__TIME__= -D__TIMESTAMP__= -funwind-tables -fPIC -pipe -m64 -march=x86-64 -pthread -Wall -Wno-unused-local-typedefs -Wno-maybe-uninitialized -Wno-missing-field-initializers -Wno-unused-parameter -g0 -fvisibility=hidden -O2 -fno-ident -fdata-sections -ffunction-sections -fvisibility-inlines-hidden -std=gnu++11 -Wno-narrowing -fno-rtti -fno-exceptions -c ../../base/base_switches.cc -o obj/base/base_static/base_switches.o
../../base/base_switches.cc:1:0: sorry, unimplemented: 64-bit mode not compiled in
// Copyright (c) 2012 The Chromium Authors. All rights reserved.

[3/495] CXX obj/base/allocator/tcmalloc/vdso_support.o
FAILED: obj/base/allocator/tcmalloc/vdso_support.o
g++ -MMD -MF obj/base/allocator/tcmalloc/vdso_support.o.d -DNO_HEAP_CHECK -DV8_DEPRECATION_WARNINGS -DUSE_UDEV -DUI_COMPOSITOR_IMAGE_TRANSPORT -DUSE_AURA=1 -DUSE_PANGO=1 -DUSE_CAIRO=1 -DUSE_GLIB=1 -DUSE_NSS_CERTS=1 -DUSE_X11=1 -DDISABLE_NACL -DFULL_SAFE_BROWSING -DSAFE_BROWSING_CSD -DSAFE_BROWSING_DB_LOCAL -DCHROMIUM_BUILD -DENABLE_MEDIA_ROUTER=1 -D_FILE_OFFSET_BITS=64 -D_LARGEFILE_SOURCE -D_LARGEFILE64_SOURCE -DNDEBUG -DNVALGRIND -DDYNAMIC_ANNOTATIONS_ENABLED=0 -DTCMALLOC_DONT_REPLACE_SYSTEM_ALLOC -I../../base/allocator -I../../third_party/tcmalloc/chromium/src/base -I../../third_party/tcmalloc/chromium/src -I../.. -Igen -fno-strict-aliasing --param=ssp-buffer-size=4 -fstack-protector -Wno-builtin-macro-redefined -D__DATE__= -D__TIME__= -D__TIMESTAMP__= -funwind-tables -fPIC -pipe -m64 -march=x86-64 -pthread -g0 -fvisibility=hidden -Wno-unused-local-typedefs -Wno-maybe-uninitialized -Wno-missing-field-initializers -Wno-unused-parameter -Wno-sign-compare -Wno-unused-result -O2 -fno-ident -fdata-sections -ffunction-sections -fvisibility-inlines-hidden -std=gnu++11 -fno-rtti -fno-exceptions -Wno-deprecated -Wno-narrowing -c ../../third_party/tcmalloc/chromium/src/base/vdso_support.cc -o obj/base/allocator/tcmalloc/vdso_support.o
../../third_party/tcmalloc/chromium/src/base/vdso_support.cc:1:0: sorry, unimplemented: 64-bit mode not compiled in
// Copyright (c) 2008, Google Inc.

[4/495] CXX obj/base/base_paths/base_paths.o
FAILED: obj/base/base_paths/base_paths.o
g++ -MMD -MF obj/base/base_paths/base_paths.o.d -DV8_DEPRECATION_WARNINGS -DUSE_UDEV -DUI_COMPOSITOR_IMAGE_TRANSPORT -DUSE_AURA=1 -DUSE_PANGO=1 -DUSE_CAIRO=1 -DUSE_GLIB=1 -DUSE_NSS_CERTS=1 -DUSE_X11=1 -DDISABLE_NACL -DFULL_SAFE_BROWSING -DSAFE_BROWSING_CSD -DSAFE_BROWSING_DB_LOCAL -DCHROMIUM_BUILD -DENABLE_MEDIA_ROUTER=1 -D_FILE_OFFSET_BITS=64 -D_LARGEFILE_SOURCE -D_LARGEFILE64_SOURCE -D__STDC_CONSTANT_MACROS -D__STDC_FORMAT_MACROS -D_FORTIFY_SOURCE=2 -DNDEBUG -DNVALGRIND -DDYNAMIC_ANNOTATIONS_ENABLED=0 -DBASE_IMPLEMENTATION -I../.. -Igen -fno-strict-aliasing --param=ssp-buffer-size=4 -fstack-protector -Wno-builtin-macro-redefined -D__DATE__= -D__TIME__= -D__TIMESTAMP__= -funwind-tables -fPIC -pipe -m64 -march=x86-64 -pthread -Wall -Wno-unused-local-typedefs -Wno-maybe-uninitialized -Wno-missing-field-initializers -Wno-unused-parameter -O2 -fno-ident -fdata-sections -ffunction-sections -g0 -fvisibility=hidden -fvisibility-inlines-hidden -std=gnu++11 -Wno-narrowing -fno-rtti -fno-exceptions -c ../../base/base_paths.cc -o obj/base/base_paths/base_paths.o
../../base/base_paths.cc:1:0: sorry, unimplemented: 64-bit mode not compiled in
// Copyright (c) 2006-2008 The Chromium Authors. All rights reserved.

[5/495] CXX obj/base/allocator/tcmalloc/central_freelist.o
FAILED: obj/base/allocator/tcmalloc/central_freelist.o
g++ -MMD -MF obj/base/allocator/tcmalloc/central_freelist.o.d -DNO_HEAP_CHECK -DV8_DEPRECATION_WARNINGS -DUSE_UDEV -DUI_COMPOSITOR_IMAGE_TRANSPORT -DUSE_AURA=1 -DUSE_PANGO=1 -DUSE_CAIRO=1 -DUSE_GLIB=1 -DUSE_NSS_CERTS=1 -DUSE_X11=1 -DDISABLE_NACL -DFULL_SAFE_BROWSING -DSAFE_BROWSING_CSD -DSAFE_BROWSING_DB_LOCAL -DCHROMIUM_BUILD -DENABLE_MEDIA_ROUTER=1 -D_FILE_OFFSET_BITS=64 -D_LARGEFILE_SOURCE -D_LARGEFILE64_SOURCE -DNDEBUG -DNVALGRIND -DDYNAMIC_ANNOTATIONS_ENABLED=0 -DTCMALLOC_DONT_REPLACE_SYSTEM_ALLOC -I../../base/allocator -I../../third_party/tcmalloc/chromium/src/base -I../../third_party/tcmalloc/chromium/src -I../.. -Igen -fno-strict-aliasing --param=ssp-buffer-size=4 -fstack-protector -Wno-builtin-macro-redefined -D__DATE__= -D__TIME__= -D__TIMESTAMP__= -funwind-tables -fPIC -pipe -m64 -march=x86-64 -pthread -g0 -fvisibility=hidden -Wno-unused-local-typedefs -Wno-maybe-uninitialized -Wno-missing-field-initializers -Wno-unused-parameter -Wno-sign-compare -Wno-unused-result -O2 -fno-ident -fdata-sections -ffunction-sections -fvisibility-inlines-hidden -std=gnu++11 -fno-rtti -fno-exceptions -Wno-deprecated -Wno-narrowing -c ../../third_party/tcmalloc/chromium/src/central_freelist.cc -o obj/base/allocator/tcmalloc/central_freelist.o
../../third_party/tcmalloc/chromium/src/central_freelist.cc:1:0: sorry, unimplemented: 64-bit mode not compiled in
// Copyright (c) 2008, Google Inc.

[6/495] CXX obj/base/base_static/switches.o
FAILED: obj/base/base_static/switches.o
g++ -MMD -MF obj/base/base_static/switches.o.d -DV8_DEPRECATION_WARNINGS -DUSE_UDEV -DUI_COMPOSITOR_IMAGE_TRANSPORT -DUSE_AURA=1 -DUSE_PANGO=1 -DUSE_CAIRO=1 -DUSE_GLIB=1 -DUSE_NSS_CERTS=1 -DUSE_X11=1 -DDISABLE_NACL -DFULL_SAFE_BROWSING -DSAFE_BROWSING_CSD -DSAFE_BROWSING_DB_LOCAL -DCHROMIUM_BUILD -DENABLE_MEDIA_ROUTER=1 -D_FILE_OFFSET_BITS=64 -D_LARGEFILE_SOURCE -D_LARGEFILE64_SOURCE -D__STDC_CONSTANT_MACROS -D__STDC_FORMAT_MACROS -D_FORTIFY_SOURCE=2 -DNDEBUG -DNVALGRIND -DDYNAMIC_ANNOTATIONS_ENABLED=0 -I../.. -Igen -fno-strict-aliasing --param=ssp-buffer-size=4 -fstack-protector -Wno-builtin-macro-redefined -D__DATE__= -D__TIME__= -D__TIMESTAMP__= -funwind-tables -fPIC -pipe -m64 -march=x86-64 -pthread -Wall -Wno-unused-local-typedefs -Wno-maybe-uninitialized -Wno-missing-field-initializers -Wno-unused-parameter -g0 -fvisibility=hidden -O2 -fno-ident -fdata-sections -ffunction-sections -fvisibility-inlines-hidden -std=gnu++11 -Wno-narrowing -fno-rtti -fno-exceptions -c ../../base/task_scheduler/switches.cc -o obj/base/base_static/switches.o
../../base/task_scheduler/switches.cc:1:0: sorry, unimplemented: 64-bit mode not compiled in
// Copyright 2016 The Chromium Authors. All rights reserved.

ninja: build stopped: subcommand failed.
Command '['ninja', '-C', '/tmp/arch32/iridium/src/iridium-browser-58.0/out/Release', 'gn']' returned non-zero exit status 1
==> ERROR: A failure occurred in build().
Aborting...

sunnaryt commented on 2017-05-22 19:35

build fails on 2 separate machines on the same part

[2574/26468] ACTION //third_party/WebKit/Source/core:make_core_generated_bison(//build/toolchain/linux:x64)
FAILED: gen/blink/core/XPathGrammar.cpp gen/blink/core/XPathGrammar.h
/usr/bin/python2 ../../third_party/WebKit/Source/build/scripts/rule_bison.py ../../third_party/WebKit/Source/core/xml/XPathGrammar.y gen/blink/core bison
Traceback (most recent call last):
File "../../third_party/WebKit/Source/build/scripts/rule_bison.py", line 82, in <module>
returnCode = subprocess.call([bisonExe, '-d', '-p', prefix, inputFile, '-o', outputCpp])
File "/usr/lib/python2.7/subprocess.py", line 168, in call
return Popen(*popenargs, **kwargs).wait()
File "/usr/lib/python2.7/subprocess.py", line 390, in __init__
errread, errwrite)
File "/usr/lib/python2.7/subprocess.py", line 1024, in _execute_child
raise child_exception
OSError: [Errno 2] No such file or directory
[2579/26468] ACTION //third_party/WebKit/Source/core/inspector:protocol_compatibility_check(//build/toolchain/linux:x64)
ninja: build stopped: subcommand failed.
==> ERROR: A failure occurred in build().
Aborting...

urldog commented on 2017-05-16 16:19

After yesterday's update on Manjaro, iridium fails to run with:
/usr/lib/chromium/chromium: error while loading shared libraries: libwebp.so.6: cannot open shared object file: No such file or directory

MarkQ commented on 2017-05-04 11:29

Thanks @someonerandom! However, I just can't build successfully! I've already drastically increased swap space and the size of my /tmp folder but it always exits with the following error:

[21678/26468] CXX obj/headless/headless_lib/types_dom.o
ninja: build stopped: subcommand failed.
==> ERROR: A failure occurred in build().
Aborting...
The build failed.

Plexcon commented on 2017-04-30 17:55

/usr/lib/chromium/chromium: error while loading shared libraries: libicui18n.so.58: cannot open shared object file: No such file or directory

someonerandom commented on 2017-04-30 11:43

@MarkQ: The command for the terminal is "chromium".

someonerandom commented on 2017-04-30 11:42

@mytbk: Please can you also apply the following change from extra/chromium?

https://git.archlinux.org/svntogit/packages.git/commit/trunk?h=packages/chromium&id=eaf75d9d1f46e2e0ea5238eecd5f6de9ca86f2c7

Otherwise iridium will fail with "/usr/lib/chromium/chromium: error while loading shared libraries: libicui18n.so.58: cannot open shared object file: No such file or directory".

Also this change seems reasonable to apply:

https://git.archlinux.org/svntogit/packages.git/commit/trunk?h=packages/chromium&id=89ddc9c3b86a577d72e31fe7b5abf1f32ff9e667

Thanks! :)

someonerandom commented on 2017-04-24 17:07

@mytbk: Source tarballs are in the official github repository:

https://github.com/iridium-browser/iridium-browser/releases

58.0 is out:

https://github.com/iridium-browser/iridium-browser/archive/iridium-browser-58.0.tar.gz

MarkQ commented on 2017-04-18 21:38

I cannot launch Iridium after successful build. The launcher doesn't show Iridium and terminal doesn't know iridium either. Any hints?

All comments