Package Details: jami-client-qt-git r299.67a7efa-1

Git Clone URL: (read-only, click to copy)
Package Base: jami-client-qt-git
Description: A free and private communication platform (QT client)
Upstream URL:
Licenses: GPL3
Conflicts: jami-gnome, jami-gnome-git
Provides: jami-client-qt
Submitter: wrycode
Maintainer: None
Last Packager: wrycode
Votes: 4
Popularity: 1.02
First Submitted: 2020-12-25 02:24
Last Updated: 2021-02-08 20:58

Latest Comments

1 2 Next › Last »

wrycode commented on 2021-08-19 19:52

I'm no longer maintaining this package. To contact me you can ask the maintainers on the Jami IRC channel for my email address (I don't want to post it here where it can be crawled).

as400 commented on 2021-08-04 13:49

There are missing deps: libnotify, qt5-quickcontrols2, qt5-svg, qt5-webengine.

andym commented on 2021-06-14 18:32

Build fails:

Starting build()... CMake Warning (dev) at /usr/share/cmake-3.20/Modules/FindPackageHandleStandardArgs.cmake:438 (message):
The package name passed to find_package_handle_standard_args
(LIB_RING_CLIENT) does not match the name of the calling package
(LibRingClient). This can lead to problems in calling code that expects
find_package result variables (e.g., _FOUND) to follow a certain
Call Stack (most recent call first):
/usr/lib64/cmake/LibRingClient/LibRingClientConfig.cmake:73 (FIND_PACKAGE_HANDLE_STANDARD_ARGS)
CMakeLists.txt:262 (find_package)
This warning is for project developers. Use -Wno-dev to suppress it.

Will expect lrc headers in /usr/include/libringclient CMake Error at /usr/lib64/cmake/Qt5/Qt5Config.cmake:28 (find_package): Could not find a package configuration file provided by "Qt5QuickControls2"
with any of the following names:


Add the installation prefix of "Qt5QuickControls2" to CMAKE_PREFIX_PATH or
set "Qt5QuickControls2_DIR" to a directory containing one of the above
files. If "Qt5QuickControls2" provides a separate development package or
SDK, be sure it has been installed.
Call Stack (most recent call first):
CMakeLists.txt:299 (find_package)

-- Configuring incomplete, errors occurred!

t-ask commented on 2021-02-09 18:56

wrycode: Yes, that fixed it, thanks. Btw. nice you add the *.desktop file, too :)

 $ yay -Rs libjamiclient-git jami-client-qt-git
 $ yay -S jami-client-qt-git

btw. I deleted old messages to keep this place clean.

wrycode commented on 2021-02-09 12:23

t-ask, my guess is that you have an old version of libringclient installed. The latest libringclient from git should give you /usr/include/libringclient/webresource.qrc

wrycode commented on 2021-02-08 21:01

They fixed that build issue quickly. I've removed the patch now.

p1trson commented on 2021-02-08 18:09

It now fails in prepare() ==> Starting prepare()...

error: patch failed: CMakeLists.txt:13

error: CMakeLists.txt: patch does not apply

==> ERROR: A failure occurred in prepare().


wrycode commented on 2021-02-08 13:31

Pushed a temporary fix for the build issue related to the .desktop file.

p1trson commented on 2021-02-07 17:51

Fails to build on pinephone (ALARM)

-- Build files have been written to: /home/alarm/jami-q/jami-client-qt-git/src/jami-client-qt/build [ 1%] Automatic MOC and UIC for target jami-qt [ 59%] Built target translations [ 59%] Built target jami-qt_autogen [ 60%] Building CXX object CMakeFiles/jami-qt.dir/jami-qt_autogen/mocs_compilation.cpp.o [ 61%] Building CXX object CMakeFiles/jami-qt.dir/src/main.cpp.o [ 61%] Building CXX object CMakeFiles/jami-qt.dir/src/bannedlistmodel.cpp.o [ 62%] Building CXX object CMakeFiles/jami-qt.dir/src/accountlistmodel.cpp.o c++: fatal error: no input files c++: fatal error: no input files compilation terminated. compilation terminated. /bin/sh: line 1: -DJAMI_DATA_DIR="/home/alarm/jami-q/jami-client-qt-git/pkg/jami-client-qt-git/usr/share/jami-qt": No such file or directory c++: fatal error: no input files compilation terminated. /bin/sh: line 1: -DJAMI_DATA_DIR="/home/alarm/jami-q/jami-client-qt-git/pkg/jami-client-qt-git/usr/share/jami-qt": No such file or directory make[2]: [CMakeFiles/jami-qt.dir/build.make:388: CMakeFiles/jami-qt.dir/src/main.cpp.o] Error 127 make[2]: Waiting for unfinished jobs.... make[2]: [CMakeFiles/jami-qt.dir/build.make:375: CMakeFiles/jami-qt.dir/jami-qt_autogen/mocs_compilation.cpp.o] Error 127 /bin/sh: line 1: -DJAMI_DATA_DIR="/home/alarm/jami-q/jami-client-qt-git/pkg/jami-client-qt-git/usr/share/jami-qt": No such file or directory make[2]: [CMakeFiles/jami-qt.dir/build.make:401: CMakeFiles/jami-qt.dir/src/bannedlistmodel.cpp.o] Error 127 c++: fatal error: no input files compilation terminated. /bin/sh: line 1: -DJAMI_DATA_DIR="/home/alarm/jami-q/jami-client-qt-git/pkg/jami-client-qt-git/usr/share/jami-qt": No such file or directory make[2]: [CMakeFiles/jami-qt.dir/build.make:414: CMakeFiles/jami-qt.dir/src/accountlistmodel.cpp.o] Error 127 make[1]: [CMakeFiles/Makefile2:181: CMakeFiles/jami-qt.dir/all] Error 2 make: *** [Makefile:149: all] Error 2 ==> ERROR: A failure occurred in build(). Aborting...

wrycode commented on 2021-01-31 22:11

Thanks, fixed.