Package Details: k3d 0.8.0.6-3

Git Clone URL: https://aur.archlinux.org/k3d.git (read-only)
Package Base: k3d
Description: A free 3D modelling and animation software
Upstream URL: http://www.k-3d.org
Licenses: GPL
Submitter: ashman
Maintainer: ashman
Last Packager: ashman
Votes: 2
Popularity: 0.000087
First Submitted: 2016-07-16 11:59
Last Updated: 2018-01-05 13:16

Latest Comments

ashman commented on 2018-06-04 17:23

I compiled the K-3D sources against the current boost version inside my Arch and Manjaro build VMs and did not encounter any build errors. What is the specific error you are experiencing?

HiJack88 commented on 2018-06-03 10:21

Package fails to compile against the current boost 1.66 from "Extra" repo.

You need to have the package "boost-63-compat" installed from AUR in order to successfully compile the package. So please add it to dependencies or build deps.

Or K3D needs an update in order to compile against the current boost version.

HiJack88 commented on 2017-02-20 08:31

I can confirm it's compiling & running fine now.
Thanks for updating the package.
Have a great day! :)

ashman commented on 2017-02-19 16:08

I have updated the package. The build break, which probably was introduced by gtkmm header changes, is fixed now.

HiJack88 commented on 2017-02-18 17:16

Hi,

i keep getting a build error while attempting to build the package.

Can you check & very that?

Thanks.


[ 16%] Building CXX object k3dsdk/ngui/CMakeFiles/k3dsdk-ngui.dir/utility.cpp.o
/tmp/yaourt-tmp-patrick/aur-k3d/src/k3d-k3d-0.8.0.6/k3dsdk/ngui/utility.cpp: In function »void k3d::ngui::non_blocking_sleep(double)«:
/tmp/yaourt-tmp-patrick/aur-k3d/src/k3d-k3d-0.8.0.6/k3dsdk/ngui/utility.cpp:63:2: Error: »signal_timeout« is not an element of »Glib«
Glib::signal_timeout().connect(
^~~~
make[2]: *** [k3dsdk/ngui/CMakeFiles/k3dsdk-ngui.dir/build.make:1839: k3dsdk/ngui/CMakeFiles/k3dsdk-ngui.dir/utility.cpp.o] Error 1
make[1]: *** [CMakeFiles/Makefile2:649: k3dsdk/ngui/CMakeFiles/k3dsdk-ngui.dir/all] Error 2
make: *** [Makefile:128: all] Error 2
==> ERROR: An error occurred in build().
Aborting...
==> ERROR:Makepkg could not create k3d.