Package Details: kdeplasma-applets-homerun 1.2.5-1

Git Clone URL: https://aur.archlinux.org/kdeplasma-applets-homerun.git (read-only)
Package Base: kdeplasma-applets-homerun
Description: An application launcher for KDE Plasma desktop
Upstream URL: http://userbase.kde.org/Homerun
Licenses: GPL, BSD, LGPL
Conflicts: kdeplasma-applets-homerun-git
Submitter: birdflesh
Maintainer: None
Last Packager: birdflesh
Votes: 94
Popularity: 0.000638
First Submitted: 2012-11-14 15:13
Last Updated: 2015-06-09 16:49

Latest Comments

birdflesh commented on 2016-01-23 08:48

Package disowned. Feel free to adopt and fix.

stativ commented on 2014-07-25 08:27

homerun merged into kdeplasma-applets-homerun. Reason: duplicate, also incorrect naming.

jsevilleja commented on 2014-07-05 12:43

Can't compile it: http://pastebin.com/9RyWzQFP

zoulou99 commented on 2014-03-06 23:10

It works fine Thank you joao

jbaojunior commented on 2014-03-06 12:35

Sorry, I forgot to remove "make -k check".


Please try again.


Joao

jbaojunior commented on 2014-03-06 12:32

Sorry, I forget remove "make check".

Please try again.


Thanks,

Joao

zoulou99 commented on 2014-03-05 23:47

I'm getting the following error

The following tests FAILED:
4 - favoriteappsmodeltest_x11 (Failed)
Errors while running CTest
tests/auto/CMakeFiles/check.dir/build.make:52: recipe for target 'tests/auto/CMakeFiles/check' failed
make[3]: *** [tests/auto/CMakeFiles/check] Error 8
make[3]: Target 'tests/auto/CMakeFiles/check.dir/build' not remade because of errors.
CMakeFiles/Makefile2:620: recipe for target 'tests/auto/CMakeFiles/check.dir/all' failed
make[2]: *** [tests/auto/CMakeFiles/check.dir/all] Error 2
CMakeFiles/Makefile2:628: recipe for target 'tests/auto/CMakeFiles/check.dir/rule' failed
make[1]: *** [tests/auto/CMakeFiles/check.dir/rule] Error 2
make[1]: Target 'check' not remade because of errors.
Makefile:316: recipe for target 'check' failed
make: *** [check] Error 2

ant32 commented on 2014-03-05 00:41

It works fine now. Thank you.

jbaojunior commented on 2014-03-04 18:04

I fix it. I put kdebase-workspace as dependency. Please test.

Thanks for help!

Joao

ant32 commented on 2014-03-04 16:25

I'm getting the following error when trying to build in a clean chroot https://wiki.archlinux.org/index.php/DeveloperWiki:Building_in_a_Clean_Chroot
-- Found automoc4: /usr/bin/automoc4
CMake Error at /usr/share/cmake-2.8/Modules/FindPackageHandleStandardArgs.cmake:108 (message):
Could NOT find KDE4Workspace (missing: KDE4Workspace_CONFIG)
Call Stack (most recent call first):
/usr/share/cmake-2.8/Modules/FindPackageHandleStandardArgs.cmake:315 (_FPHSA_FAILURE_MESSAGE)
/usr/share/apps/cmake/modules/FindKDE4Workspace.cmake:70 (find_package_handle_standard_args)
CMakeLists.txt:11 (find_package)

All comments