Package Details: kdeplasma-applets-homerun 1.2.5-1

Git Clone URL: https://aur.archlinux.org/kdeplasma-applets-homerun.git (read-only)
Package Base: kdeplasma-applets-homerun
Description: An application launcher for KDE Plasma desktop
Upstream URL: http://userbase.kde.org/Homerun
Licenses: GPL, BSD, LGPL
Conflicts: kdeplasma-applets-homerun-git
Submitter: birdflesh
Maintainer: None
Last Packager: birdflesh
Votes: 94
Popularity: 0.000108
First Submitted: 2012-11-14 15:13
Last Updated: 2015-06-09 16:49

Latest Comments

birdflesh commented on 2016-01-23 08:48

Package disowned. Feel free to adopt and fix.

stativ commented on 2014-07-25 08:27

homerun merged into kdeplasma-applets-homerun. Reason: duplicate, also incorrect naming.

jsevilleja commented on 2014-07-05 12:43

Can't compile it: http://pastebin.com/9RyWzQFP

zoulou99 commented on 2014-03-06 23:10

It works fine Thank you joao

jbaojunior commented on 2014-03-06 12:35

Sorry, I forgot to remove "make -k check".


Please try again.


Joao

jbaojunior commented on 2014-03-06 12:32

Sorry, I forget remove "make check".

Please try again.


Thanks,

Joao

zoulou99 commented on 2014-03-05 23:47

I'm getting the following error

The following tests FAILED:
4 - favoriteappsmodeltest_x11 (Failed)
Errors while running CTest
tests/auto/CMakeFiles/check.dir/build.make:52: recipe for target 'tests/auto/CMakeFiles/check' failed
make[3]: *** [tests/auto/CMakeFiles/check] Error 8
make[3]: Target 'tests/auto/CMakeFiles/check.dir/build' not remade because of errors.
CMakeFiles/Makefile2:620: recipe for target 'tests/auto/CMakeFiles/check.dir/all' failed
make[2]: *** [tests/auto/CMakeFiles/check.dir/all] Error 2
CMakeFiles/Makefile2:628: recipe for target 'tests/auto/CMakeFiles/check.dir/rule' failed
make[1]: *** [tests/auto/CMakeFiles/check.dir/rule] Error 2
make[1]: Target 'check' not remade because of errors.
Makefile:316: recipe for target 'check' failed
make: *** [check] Error 2

ant32 commented on 2014-03-05 00:41

It works fine now. Thank you.

jbaojunior commented on 2014-03-04 18:04

I fix it. I put kdebase-workspace as dependency. Please test.

Thanks for help!

Joao

ant32 commented on 2014-03-04 16:25

I'm getting the following error when trying to build in a clean chroot https://wiki.archlinux.org/index.php/DeveloperWiki:Building_in_a_Clean_Chroot
-- Found automoc4: /usr/bin/automoc4
CMake Error at /usr/share/cmake-2.8/Modules/FindPackageHandleStandardArgs.cmake:108 (message):
Could NOT find KDE4Workspace (missing: KDE4Workspace_CONFIG)
Call Stack (most recent call first):
/usr/share/cmake-2.8/Modules/FindPackageHandleStandardArgs.cmake:315 (_FPHSA_FAILURE_MESSAGE)
/usr/share/apps/cmake/modules/FindKDE4Workspace.cmake:70 (find_package_handle_standard_args)
CMakeLists.txt:11 (find_package)

BrainwreckedTech commented on 2014-02-28 20:25

You also need kdebase-workspace as a dependency. Homerun won't compile without it. (Usually taken care of if you already have KDE installed.)

jbaojunior commented on 2014-02-03 11:48

Nadley,

I remove o check target. It isn't mandatory.

Thanks

nadley commented on 2014-02-03 08:48

Hi,

I have a small error when I try to install homerun, the check function in PKGBUILD try to run unit test and failed

Here is the error : http://pastebin.archlinux.fr/487234

I install homerun by bypassing the make -k check in PKGBUILD but this is not clean.

Can we remove the check target from PKGBUILD or is it mandatory ?

Thanks

jbaojunior commented on 2014-01-31 20:13

Clean Menu for KDE

jbaojunior commented on 2014-01-31 18:46

My first package. In case of problems, comment.

kristianjgs commented on 2013-05-12 05:32

Great Work!! Thanks!

toketin commented on 2013-05-09 21:02

I can't update it since the upgrade of libpng, this is the output:

Linking CXX executable homerunviewer
/usr/bin/ld: warning: libpng15.so.15, needed by /usr/lib/libQtGui.so, not found (try using -rpath or -rpath-link)
/usr/lib/libQtGui.so: riferimento non definito a "png_set_write_fn@PNG15_0"
/usr/lib/libQtGui.so: riferimento non definito a "png_set_strip_16@PNG15_0"
/usr/lib/libQtGui.so: riferimento non definito a "png_write_end@PNG15_0"
/usr/lib/libQtGui.so: riferimento non definito a "png_set_gamma@PNG15_0"
/usr/lib/libQtGui.so: riferimento non definito a "png_set_interlace_handling@PNG15_0"
/usr/lib/libQtGui.so: riferimento non definito a "png_set_text@PNG15_0"
/usr/lib/libQtGui.so: riferimento non definito a "png_set_tRNS@PNG15_0"
/usr/lib/libQtGui.so: riferimento non definito a "png_set_packing@PNG15_0"
/usr/lib/libQtGui.so: riferimento non definito a "png_read_image@PNG15_0"
/usr/lib/libQtGui.so: riferimento non definito a "png_get_image_width@PNG15_0"
/usr/lib/libQtGui.so: riferimento non definito a "png_read_end@PNG15_0"
/usr/lib/libQtGui.so: riferimento non definito a "png_get_text@PNG15_0"
/usr/lib/libQtGui.so: riferimento non definito a "png_get_channels@PNG15_0"
/usr/lib/libQtGui.so: riferimento non definito a "png_write_image@PNG15_0"
/usr/lib/libQtGui.so: riferimento non definito a "png_get_gAMA@PNG15_0"
/usr/lib/libQtGui.so: riferimento non definito a "png_write_rows@PNG15_0"
/usr/lib/libQtGui.so: riferimento non definito a "png_get_valid@PNG15_0"
/usr/lib/libQtGui.so: riferimento non definito a "png_get_x_pixels_per_meter@PNG15_0"
/usr/lib/libQtGui.so: riferimento non definito a "png_read_info@PNG15_0"
/usr/lib/libQtGui.so: riferimento non definito a "png_get_PLTE@PNG15_0"
/usr/lib/libQtGui.so: riferimento non definito a "png_create_read_struct@PNG15_0"
/usr/lib/libQtGui.so: riferimento non definito a "png_set_gray_to_rgb@PNG15_0"
/usr/lib/libQtGui.so: riferimento non definito a "png_get_image_height@PNG15_0"
/usr/lib/libQtGui.so: riferimento non definito a "png_write_chunk@PNG15_0"
/usr/lib/libQtGui.so: riferimento non definito a "png_set_invert_mono@PNG15_0"
/usr/lib/libQtGui.so: riferimento non definito a "png_set_gAMA@PNG15_0"
/usr/lib/libQtGui.so: riferimento non definito a "png_create_write_struct@PNG15_0"
/usr/lib/libQtGui.so: riferimento non definito a "png_set_sBIT@PNG15_0"
/usr/lib/libQtGui.so: riferimento non definito a "png_get_io_ptr@PNG15_0"
/usr/lib/libQtGui.so: riferimento non definito a "png_get_tRNS@PNG15_0"
/usr/lib/libQtGui.so: riferimento non definito a "png_error@PNG15_0"
/usr/lib/libQtGui.so: riferimento non definito a "png_read_update_info@PNG15_0"
/usr/lib/libQtGui.so: riferimento non definito a "png_destroy_write_struct@PNG15_0"
/usr/lib/libQtGui.so: riferimento non definito a "png_set_compression_level@PNG15_0"
/usr/lib/libQtGui.so: riferimento non definito a "png_set_bgr@PNG15_0"
/usr/lib/libQtGui.so: riferimento non definito a "png_destroy_read_struct@PNG15_0"
/usr/lib/libQtGui.so: riferimento non definito a "png_set_pHYs@PNG15_0"
/usr/lib/libQtGui.so: riferimento non definito a "png_set_oFFs@PNG15_0"
/usr/lib/libQtGui.so: riferimento non definito a "png_set_error_fn@PNG15_0"
/usr/lib/libQtGui.so: riferimento non definito a "png_write_info@PNG15_0"
/usr/lib/libQtGui.so: riferimento non definito a "png_get_IHDR@PNG15_0"
/usr/lib/libQtGui.so: riferimento non definito a "png_set_sig_bytes@PNG15_0"
/usr/lib/libQtGui.so: riferimento non definito a "png_set_longjmp_fn@PNG15_0"
/usr/lib/libQtGui.so: riferimento non definito a "png_set_expand@PNG15_0"
/usr/lib/libQtGui.so: riferimento non definito a "png_set_IHDR@PNG15_0"
/usr/lib/libQtGui.so: riferimento non definito a "png_set_read_fn@PNG15_0"
/usr/lib/libQtGui.so: riferimento non definito a "png_create_info_struct@PNG15_0"
/usr/lib/libQtGui.so: riferimento non definito a "png_set_PLTE@PNG15_0"
/usr/lib/libQtGui.so: riferimento non definito a "png_get_y_pixels_per_meter@PNG15_0"
/usr/lib/libQtGui.so: riferimento non definito a "png_set_filler@PNG15_0"
/usr/lib/libQtGui.so: riferimento non definito a "png_set_packswap@PNG15_0"
collect2: error: ld returned 1 exit status

birdflesh commented on 2013-02-28 11:57

Adding "-DQT_QMAKE_EXECUTABLE=qmake4" to the cmake options should fix this and will be added when qt4 hits [extra].

You should consider following arch-dev-public when using testing and please avoid flagging packages when they are not out of date.

andre.vmatos commented on 2013-02-28 11:45

With qt4 and qt5 from testing, failing with:
CMake Error at /usr/share/cmake-2.8/Modules/FindPackageHandleStandardArgs.cmake:97 (message):
Could NOT find Phonon (missing: PHONON_INCLUDE_DIR) (Required is at least
version "4.3.80")
Call Stack (most recent call first):
/usr/share/cmake-2.8/Modules/FindPackageHandleStandardArgs.cmake:291 (_FPHSA_FAILURE_MESSAGE)
/usr/share/apps/cmake/modules/FindPhonon.cmake:35 (find_package_handle_standard_args)
/usr/share/apps/cmake/modules/FindKDE4Internal.cmake:705 (find_package)
/usr/share/cmake-2.8/Modules/FindKDE4.cmake:95 (find_package)
CMakeLists.txt:26 (find_package)


-- Configuring incomplete, errors occurred!

birdflesh commented on 2012-11-15 10:01

Thanks for the suggestion, archdria.

archdria commented on 2012-11-14 20:57

I think the homepage should be: http://userbase.kde.org/Homerun