Package Details: kgtk 0.11.0-4

Git Clone URL: https://aur.archlinux.org/kgtk.git (read-only)
Package Base: kgtk
Description: LD_PRELOAD hack with helper scripts to make gtk and qt-only programs use KDE file dialogs.
Upstream URL: http://www.kde-apps.org/content/show.php?content=36077
Licenses: GPL
Submitter: None
Maintainer: sjakub
Last Packager: sjakub
Votes: 111
Popularity: 0.152431
First Submitted: 2006-05-11 17:47
Last Updated: 2016-08-01 22:59

Latest Comments

1 2 3 Next › Last »

Ashark commented on 2018-06-24 21:52

The link in the source() is broken. It actually downloads html document intead of archive. Trying to go this url manually with variables resolved also redirect you to a web page instead of allowing you to download archive.

When downloading manually, I get the following url: https://www.opendesktop.org/p/1081260/startdownload?file_id=1460972667&file_name=36077-KGtk-0.11.0.tar.bz2&file_type=application/x-bzip2&file_size=41195&url=https://dl.opendesktop.org/api/files/downloadfile/id/1460972667/s/ffdd146bc57c7ecd4f8948583dd6f543/t/1529879761/u//36077-KGtk-0.11.0.tar.bz2

But seems like it is session dependent. This should be fixed.

ochiman commented on 2018-01-26 17:31

Go to https://www.opendesktop.org/c/1460972666 , manual download it, copy de link from download, edit the package build, and modify the link to the one you copy

The site appears to not allowed downloads with the old link.

Ps: if needed change shasum to SKIP, but in this case is the same version.

Notex commented on 2018-01-20 06:41

Package broken.

==> Making package: kgtk 0.11.0-4 (Sat Jan 20 16:41:02 AEST 2018) ==> Checking runtime dependencies... ==> Checking buildtime dependencies... ==> Retrieving sources... -> Found 36077-KGtk-0.11.0.tar.bz2 ==> Validating source files with sha1sums... 36077-KGtk-0.11.0.tar.bz2 ... FAILED ==> ERROR: One or more files did not pass the validity check! :: Unable to build kgtk - makepkg exited with code: 1

maxigaz commented on 2016-08-05 09:57

Now it's working, thank you!

sjakub commented on 2016-08-01 23:01

Updated

maxigaz commented on 2016-07-30 16:56

I get the following:

==> ERROR: One or more files did not pass the validity check!
==> ERROR: Makepkg was unable to build kgtk.

pavbaranov commented on 2014-12-30 14:37

Since pacman 4.2 PKGBUILD not builds package.

pantonov commented on 2014-04-27 06:40

-----------------------------------------
/usr/include/kio/global.h:29:44: fatal error: QFile: No such file or directory
#include <QFile> // for QFile::Permissions
-----------------------------------------
It is a bug in kio header files. You should change include directive at string 29 of /usr/include/kio/global.h to #include <QtCore/QFile>

SysGhost commented on 2014-04-23 13:26

Won't compile.

Error messages follow:
----------------------------------------------
tmp/yaourt-tmp-sysghost/aur-kgtk/src/KGtk-0.11.0/gtk2/kgtk.c:2400:26: warning: ‘GtkStock’ is deprecated [-Wdeprecated-declarations]
/tmp/yaourt-tmp-sysghost/aur-kgtk/src/KGtk-0.11.0/gtk2/kgtk.c:2400:26: warning: ‘GtkStock’ is deprecated [-Wdeprecated-declarations]
/tmp/yaourt-tmp-sysghost/aur-kgtk/src/KGtk-0.11.0/gtk2/kgtk.c: In function ‘handleGtkFileChooserButtonClicked’:
/tmp/yaourt-tmp-sysghost/aur-kgtk/src/KGtk-0.11.0/gtk2/kgtk.c:2600:58: warning: unused parameter ‘button’ [-Wunused-parameter]
static void handleGtkFileChooserButtonClicked(GtkButton *button, gpointer user_data)
^
/tmp/yaourt-tmp-sysghost/aur-kgtk/src/KGtk-0.11.0/gtk2/kgtk.c: In function ‘kgtk_g_module_check_init’:
/tmp/yaourt-tmp-sysghost/aur-kgtk/src/KGtk-0.11.0/gtk2/kgtk.c:2744:49: warning: unused parameter ‘module’ [-Wunused-parameter]
const gchar * kgtk_g_module_check_init(GModule *module)
^
/tmp/yaourt-tmp-sysghost/aur-kgtk/src/KGtk-0.11.0/gtk2/kgtk.c: At top level:
/tmp/yaourt-tmp-sysghost/aur-kgtk/src/KGtk-0.11.0/gtk2/kgtk.c:2750:37: warning: ‘struct PR_LoadLibrary’ declared inside parameter list [enabled by default]
void * PR_FindFunctionSymbol(struct PR_LoadLibrary *lib, const char *raw_name)
^
/tmp/yaourt-tmp-sysghost/aur-kgtk/src/KGtk-0.11.0/gtk2/kgtk.c:2750:37: warning: its scope is only this definition or declaration, which is probably not what you want [enabled by default]
Linking C shared library ../lib/libkgtk3.so
[ 15%] Built target kgtk3
Scanning dependencies of target kdialogd4_bin_automoc
Generating kdialogd.moc
[ 15%] Built target kdialogd4_bin_automoc
Scanning dependencies of target kdialogd4_bin
[ 23%] Building CXX object kdialogd4/CMakeFiles/kdialogd4_bin.dir/kdialogd4_bin_automoc.o
[ 30%] Building CXX object kdialogd4/CMakeFiles/kdialogd4_bin.dir/kdialogd.o
In file included from /usr/include/kfileitem.h:25:0,
from /usr/include/kdirlister.h:24,
from /usr/include/kdiroperator.h:30,
from /tmp/yaourt-tmp-sysghost/aur-kgtk/src/KGtk-0.11.0/kdialogd4/kdialogd.cpp:28:
/usr/include/kio/global.h:29:44: fatal error: QFile: No such file or directory
#include <QFile> // for QFile::Permissions
^
compilation terminated.
kdialogd4/CMakeFiles/kdialogd4_bin.dir/build.make:80: recipe for target 'kdialogd4/CMakeFiles/kdialogd4_bin.dir/kdialogd.o' failed
make[2]: *** [kdialogd4/CMakeFiles/kdialogd4_bin.dir/kdialogd.o] Error 1
CMakeFiles/Makefile2:212: recipe for target 'kdialogd4/CMakeFiles/kdialogd4_bin.dir/all' failed
make[1]: *** [kdialogd4/CMakeFiles/kdialogd4_bin.dir/all] Error 2
Makefile:146: recipe for target 'all' failed
make: *** [all] Error 2
==> ERROR: A failure occurred in build().
Aborting...
==> ERROR: Makepkg was unable to build kgtk.

sjakub commented on 2013-03-02 22:19

Updated. Thanks ava1ar!