Package Details: kino 1.3.4-6

Git Clone URL: https://aur.archlinux.org/kino.git (read-only)
Package Base: kino
Description: A non-linear DV editor
Upstream URL: http://www.kinodv.org/
Licenses: GPL
Submitter: giovanni
Maintainer: ConnorBehan
Last Packager: ConnorBehan
Votes: 16
Popularity: 2.038822
First Submitted: 2013-12-05 08:25
Last Updated: 2016-04-28 17:05

Latest Comments

hexadecagram commented on 2014-01-05 07:35

http://lists.freebsd.org/pipermail/freebsd-ports/2012-December/079990.html

I copy/paste'd that patch into ${startdir}/ffmpeg-Makefile.patch. Here's a patch to PKGBUILD with source, md5sums and build() modified:

http://pastebin.com/Knusf1d6

This results in a successful build.

hexadecagram commented on 2014-01-05 06:55

When attempting to build this, I get the following (texi2html 5.0-2):

texi2html -monolithic -number doc/ffmpeg-doc.texi
Option number is ambiguous (number-footnotes, number-sections)
Try `texi2html --help' for more information.
Makefile:132: recipe for target 'doc/ffmpeg-doc.html' failed
make[2]: *** [doc/ffmpeg-doc.html] Error 2
make[2]: Leaving directory '/home/acc/tmp/yaourt-tmp-acc/aur-kino/src/kino-1.3.4/ffmpeg'
Makefile:436: recipe for target 'all-recursive' failed
make[1]: *** [all-recursive] Error 1
make[1]: Leaving directory '/home/acc/tmp/yaourt-tmp-acc/aur-kino/src/kino-1.3.4'
Makefile:325: recipe for target 'all' failed
make: *** [all] Error 2

hexadecagram commented on 2014-01-05 06:54

When attempting to build this, I get the following (texi2html 5.0-2):

texi2html -monolithic -number doc/ffmpeg-doc.texi
Option number is ambiguous (number-footnotes, number-sections)
Try `texi2html --help' for more information.
Makefile:132: recipe for target 'doc/ffmpeg-doc.html' failed
make[2]: *** [doc/ffmpeg-doc.html] Error 2
make[2]: Leaving directory '/home/acc/tmp/yaourt-tmp-acc/aur-kino/src/kino-1.3.4
/ffmpeg'
Makefile:436: recipe for target 'all-recursive' failed
make[1]: *** [all-recursive] Error 1
make[1]: Leaving directory '/home/acc/tmp/yaourt-tmp-acc/aur-kino/src/kino-1.3.4
'
Makefile:325: recipe for target 'all' failed
make: *** [all] Error 2