Package Details: kipi-plugins-git r11750.0e0e4f5-1

Git Clone URL: https://aur.archlinux.org/kipi-plugins-git.git (read-only)
Package Base: kipi-plugins-git
Description: A collection of plugins extending the KDE graphics and image applications as digiKam
Upstream URL: http://www.kipi-plugins.org/
Licenses: GPL, LGPL, FDL
Groups: digikamsc-git
Conflicts: kipi-plugins
Provides: kipi-plugins
Submitter: flamelab
Maintainer: Sevenseven
Last Packager: Sevenseven
Votes: 17
Popularity: 0.000000
First Submitted: 2011-02-06 11:08
Last Updated: 2016-09-16 08:23

Dependencies (14)

Required by (3)

Sources (1)

Latest Comments

« First ‹ Previous 1 2 3 4 5 Next › Last »

paulbarbee commented on 2012-10-06 18:51

I'm getting the following when trying tpo update kipi-plugins-git:


[ 2%] Building CXX object timeadjust/CMakeFiles/kipiplugin_timeadjust.dir/plugin_timeadjust.o
/var/abs/local/yaourtbuild/kipi-plugins-git/src/kipi-plugins/timeadjust/plugin_timeadjust.cpp: In constructor ‘KIPITimeAdjustPlugin::Plugin_TimeAdjust::Plugin_TimeAdjust(QObject*, const QVariantList&)’:
/var/abs/local/yaourtbuild/kipi-plugins-git/src/kipi-plugins/timeadjust/plugin_timeadjust.cpp:74:47: error: ‘setUiBaseName’ was not declared in this scope
/var/abs/local/yaourtbuild/kipi-plugins-git/src/kipi-plugins/timeadjust/plugin_timeadjust.cpp:75:14: error: ‘setupXML’ was not declared in this scope
/var/abs/local/yaourtbuild/kipi-plugins-git/src/kipi-plugins/timeadjust/plugin_timeadjust.cpp: In member function ‘virtual void KIPITimeAdjustPlugin::Plugin_TimeAdjust::setup(QWidget*)’:
/var/abs/local/yaourtbuild/kipi-plugins-git/src/kipi-plugins/timeadjust/plugin_timeadjust.cpp:88:20: error: ‘interface’ was not declared in this scope
/var/abs/local/yaourtbuild/kipi-plugins-git/src/kipi-plugins/timeadjust/plugin_timeadjust.cpp:94:43: error: ‘interface’ was not declared in this scope
/var/abs/local/yaourtbuild/kipi-plugins-git/src/kipi-plugins/timeadjust/plugin_timeadjust.cpp: In member function ‘void KIPITimeAdjustPlugin::Plugin_TimeAdjust::setupActions()’:
/var/abs/local/yaourtbuild/kipi-plugins-git/src/kipi-plugins/timeadjust/plugin_timeadjust.cpp:103:36: error: ‘setDefaultCategory’ was not declared in this scope
/var/abs/local/yaourtbuild/kipi-plugins-git/src/kipi-plugins/timeadjust/plugin_timeadjust.cpp:113:47: error: no matching function for call to ‘KIPITimeAdjustPlugin::Plugin_TimeAdjust::addAction(const char [11], KAction*&)’
/var/abs/local/yaourtbuild/kipi-plugins-git/src/kipi-plugins/timeadjust/plugin_timeadjust.cpp:113:47: note: candidate is:
In file included from /var/abs/local/yaourtbuild/kipi-plugins-git/src/kipi-plugins-build/timeadjust/../../kipi-plugins/timeadjust/plugin_timeadjust.h:33:0,
from /var/abs/local/yaourtbuild/kipi-plugins-git/src/kipi-plugins-build/timeadjust/plugin_timeadjust.moc:10,
from /var/abs/local/yaourtbuild/kipi-plugins-git/src/kipi-plugins/timeadjust/plugin_timeadjust.cpp:24:
/usr/include/libkipi/plugin.h:79:10: note: void KIPI::Plugin::addAction(KAction*)
/usr/include/libkipi/plugin.h:79:10: note: candidate expects 1 argument, 2 provided
/var/abs/local/yaourtbuild/kipi-plugins-git/src/kipi-plugins/timeadjust/plugin_timeadjust.cpp: In member function ‘void KIPITimeAdjustPlugin::Plugin_TimeAdjust::slotActivate()’:
/var/abs/local/yaourtbuild/kipi-plugins-git/src/kipi-plugins/timeadjust/plugin_timeadjust.cpp:118:40: error: ‘interface’ was not declared in this scope
In file included from /usr/include/klibloader.h:29:0,
from /usr/include/kgenericfactory.h:22,
from /var/abs/local/yaourtbuild/kipi-plugins-git/src/kipi-plugins/timeadjust/plugin_timeadjust.cpp:33:
/usr/include/kpluginfactory.h: In instantiation of ‘static QObject* KPluginFactory::createInstance(QWidget*, QObject*, const QVariantList&) [with impl = KIPITimeAdjustPlugin::Plugin_TimeAdjust; ParentType = QObject; QObject = QObject; QVariantList = QList<QVariant>]’:
/usr/include/kpluginfactory.h:495:70: required from ‘QObject* (* KPluginFactory::InheritanceChecker<impl>::createInstanceFunction(...))(QWidget*, QObject*, const QVariantList&) [with impl = KIPITimeAdjustPlugin::Plugin_TimeAdjust; KPluginFactory::CreateInstanceFunction = QObject* (*)(QWidget*, QObject*, const QList<QVariant>&); QObject = QObject; QVariantList = QList<QVariant>]’
/var/abs/local/yaourtbuild/kipi-plugins-git/src/kipi-plugins/timeadjust/plugin_timeadjust.cpp:51:1: required from here
/usr/include/kpluginfactory.h:477:32: error: cannot allocate an object of abstract type ‘KIPITimeAdjustPlugin::Plugin_TimeAdjust’
In file included from /var/abs/local/yaourtbuild/kipi-plugins-git/src/kipi-plugins-build/timeadjust/plugin_timeadjust.moc:10:0,
from /var/abs/local/yaourtbuild/kipi-plugins-git/src/kipi-plugins/timeadjust/plugin_timeadjust.cpp:24:
/var/abs/local/yaourtbuild/kipi-plugins-git/src/kipi-plugins-build/timeadjust/../../kipi-plugins/timeadjust/plugin_timeadjust.h:40:7: note: because the following virtual functions are pure within ‘KIPITimeAdjustPlugin::Plugin_TimeAdjust’:
In file included from /var/abs/local/yaourtbuild/kipi-plugins-git/src/kipi-plugins-build/timeadjust/../../kipi-plugins/timeadjust/plugin_timeadjust.h:33:0,
from /var/abs/local/yaourtbuild/kipi-plugins-git/src/kipi-plugins-build/timeadjust/plugin_timeadjust.moc:10,
from /var/abs/local/yaourtbuild/kipi-plugins-git/src/kipi-plugins/timeadjust/plugin_timeadjust.cpp:24:
/usr/include/libkipi/plugin.h:75:24: note: virtual KIPI::Category KIPI::Plugin::category(KAction*) const
make[2]: *** [timeadjust/CMakeFiles/kipiplugin_timeadjust.dir/plugin_timeadjust.o] Error 1
make[1]: *** [timeadjust/CMakeFiles/kipiplugin_timeadjust.dir/all] Error 2
make: *** [all] Error 2

Sevenseven commented on 2011-11-10 08:42

Fixed.

Anonymous comment on 2011-11-09 18:38

The install field should not be an array, but a single string: install='kipi-plugins-git.install'. Otherwise makepkg complains that it couldn't find file ('kipi-plugins-git.install').

Sevenseven commented on 2011-06-23 01:48

Ok

alphazo commented on 2011-06-22 21:20

Thanks. That did the trick!

Sevenseven commented on 2011-06-22 12:20

Try to update libkmap-git.

alphazo commented on 2011-06-22 06:21

here it is:

Scanning dependencies of target kipiplugin_gpssync
[ 95%] Building CXX object gpssync/CMakeFiles/kipiplugin_gpssync.dir/kipiplugin_gpssync_automoc.o
[ 95%] Building CXX object gpssync/CMakeFiles/kipiplugin_gpssync.dir/gpssyncdialog.o
In file included from /tmp/yaourt-tmp-alpha/aur-kipi-plugins-git/src/kipi-plugins/gpssync/gpssyncdialog.cpp:100:0:
/tmp/yaourt-tmp-alpha/aur-kipi-plugins-git/src/kipi-plugins/gpssync/gpslistviewcontextmenu.h:34:37: fatal error: libkmap/lookup_altitude.h: No such file or directory
compilation terminated.
make[2]: *** [gpssync/CMakeFiles/kipiplugin_gpssync.dir/gpssyncdialog.o] Error 1
make[1]: *** [gpssync/CMakeFiles/kipiplugin_gpssync.dir/all] Error 2
make: *** [all] Error 2

Sevenseven commented on 2011-06-22 00:02

Log is not full, cd to the build dir, run make -j1 and find Error 1(and few line above).

alphazo commented on 2011-06-21 20:19

I'm getting the following error:
..
[ 88%] Building CXX object dngconverter/CMakeFiles/libdng.dir/dngwriter/extra/dng_sdk/dng_tone_curve.o
[ 88%] Building CXX object dngconverter/CMakeFiles/libdng.dir/dngwriter/extra/dng_sdk/dng_hue_sat_map.o
[ 89%] Building CXX object dngconverter/CMakeFiles/libdng.dir/dngwriter/extra/dng_sdk/dng_pthread.o
Linking CXX static library ../lib/liblibdng.a
[ 89%] Built target libdng
make: *** [all] Error 2
==> ERROR: A failure occurred in build().
Aborting...
==> ERROR: Makepkg was unable to build kipi-plugins-git.

Sevenseven commented on 2011-03-14 09:27

update