Package Details: ksmoothdock 6.3-3

Git Clone URL: (read-only, click to copy)
Package Base: ksmoothdock
Description: A cool desktop panel for KDE Plasma 5
Upstream URL:
Keywords: dock kde panel plasma qt5
Licenses: GPL3
Submitter: omni
Maintainer: xiota
Last Packager: xiota
Votes: 6
Popularity: 0.000000
First Submitted: 2017-05-18 17:56 (UTC)
Last Updated: 2023-10-24 22:09 (UTC)

Required by (0)

Sources (1)

Pinned Comments

Latest Comments

kinoe commented on 2023-10-21 22:02 (UTC) (edited on 2023-10-21 22:03 (UTC) by kinoe)

make[2]: *** [CMakeFiles/ksmoothdock_lib.dir/build.make:76: CMakeFiles/ksmoothdock_lib.dir/ksmoothdock_lib_autogen/mocs_compilation.cpp.o] error 1
make[1]: *** [CMakeFiles/Makefile2:436: CMakeFiles/ksmoothdock_lib.dir/all] error 2

kinoe commented on 2023-10-20 14:33 (UTC) (edited on 2023-10-20 14:34 (UTC) by kinoe)

ksmoothdock needs to be updated to reflect the changes to the naming of KDE packages:

Installing kactivities5 (5.111.0-1) breaks "kactivities" dependency, needed by ksmoothdock
Installing kxmlgui5 (5.111.0-1) breaks "kxmlgui" dependency, needed by ksmoothdock

GraveDigger commented on 2020-01-17 11:37 (UTC) (edited on 2020-01-17 11:39 (UTC) by GraveDigger)

this build of ksmoothdock does not like to show itself when placed on the leftside of the screen and autohide is used. main github thread below.

manjaro kde 18.1.5 rc1 testing build.

thiosin commented on 2019-11-22 19:31 (UTC)

Tried to build at latest commit (793b94e7559f93a22e17e9370e01108cc4ec8014), still same error: usr/include/c++/9.2.0/bits/fs_fwd.:39: Parse error at "std"

simona commented on 2019-11-10 12:05 (UTC)

usr/include/c++/9.2.0/bits/fs_fwd.:39: Parse error at "std"

kinoe commented on 2019-11-09 22:51 (UTC) (edited on 2019-11-09 22:52 (UTC) by kinoe)

Build error: AutoMoc subprocess error

The moc process failed to compile "/home/kinoe/.cache/pikaur/build/ksmoothdock/src/ksmoothdock-6.0/src/utils/"


"/home/kinoe/.cache/pikaur/build/ksmoothdock/src/ksmoothdock-6.0/command_utils_test_autogen/include/command_utils_test.moc" included by



usr/include/c++/9.2.0/bits/fs_fwd.:39: Parse error at "std"

make[2]: *** [CMakeFiles/command_utils_test_autogen.dir/build.make:58: CMakeFiles/command_utils_test_autogen] Error 1

make[1]: *** [CMakeFiles/Makefile2:904: CMakeFiles/command_utils_test_autogen.dir/all] Error 2

make: *** [Makefile:141: all] Error 2