Package Details: ktechlab 0.50.0-2

Git Clone URL: https://aur.archlinux.org/ktechlab.git (read-only, click to copy)
Package Base: ktechlab
Description: IDE for microcontrollers and electronic simulation
Upstream URL: https://invent.kde.org/sdk/ktechlab
Keywords: eda electronics microcontroller simulation
Licenses: GPL2
Submitter: zoe1337
Maintainer: zoe1337 (metafex)
Last Packager: zoe1337
Votes: 6
Popularity: 0.000514
First Submitted: 2019-03-27 19:56 (UTC)
Last Updated: 2020-09-24 21:56 (UTC)

Latest Comments

JohnRobson commented on 2021-07-09 19:21 (UTC)

==> Validating source files with sha256sums... ktechlab-0.50.0.tar.xz ... FAILED ==> ERROR: One or more files did not pass the validity check! error downloading sources: ktechlab

zoe1337 commented on 2020-09-24 21:42 (UTC)

thanks caltlgin for vastly improving the package!

metafex commented on 2019-07-10 16:50 (UTC)

KTechlab is currently being ported to KF5 which will solve the issues with the dependencies it currently has. As soon as a new release happens, it will be updated.

linuxyz commented on 2019-07-09 20:33 (UTC) (edited on 2019-07-09 20:45 (UTC) by linuxyz)

Failure to build because of a problem with bulding the dependency kdelibs apparently:

/home/linuxyz/.cache/pikaur/build/kdelibs/src/kdelibs-4.14.38/kdecore/config/kconfigbackend.cpp:42:10: fatal error: kconfigbackend.moc: No such file or directory 42 | #include "kconfigbackend.moc" | ^~~~~~~~~~~~~~~~~~~~ compilation terminated. make[2]: [kdecore/CMakeFiles/kdecore.dir/build.make:167: kdecore/CMakeFiles/kdecore.dir/config/kconfigbackend.cpp.o] Error 1 make[1]: [CMakeFiles/Makefile2:1154: kdecore/CMakeFiles/kdecore.dir/all] Error 2 make: *** [Makefile:163: all] Error 2 ==> ERROR: A failure occurred in build(). Aborting...

Command 'makepkg --force' failed to execute.