Package Details: kvpm 0.9.9-1

Git Clone URL: https://aur.archlinux.org/kvpm.git (read-only)
Package Base: kvpm
Description: Front end for Linux LVM and Gnu parted. It also handles creating and mounting file systems
Upstream URL: http://sourceforge.net/projects/kvpm/
Licenses: GPL
Submitter: None
Maintainer: dlandau
Last Packager: dlandau
Votes: 30
Popularity: 0.886814
First Submitted: 2009-11-17 02:20
Last Updated: 2015-06-27 14:59

Dependencies (5)

Required by (0)

Sources (1)

Latest Comments

e8hffff commented on 2014-12-23 12:22

This should be in the main repository

dlandau commented on 2013-09-15 07:26

Why did someone flag this package out of date? I don't see any newer version from upstream.

DigitalPioneer commented on 2013-06-04 17:55

Arch is getting rid of /usr/sbin, and this package installs files in that directory. Please alter the package to move those files to /usr/bin instead. See: https://www.archlinux.org/news/binaries-move-to-usrbin-requiring-update-intervention/

artemklevtsov commented on 2013-04-19 09:19

I faced some errors:
I/O warning : failed to load external entity "/usr/share/xml/docbook/xsl-stylesheets-1.78.0/html/autoidx.xsl"
compilation error: file /usr/share/apps/ksgmltools2/customization/kde-include-common.xsl line 4 element import
xsl:import : unable to load /usr/share/xml/docbook/xsl-stylesheets-1.78.0/html/autoidx.xsl
I/O warning : failed to load external entity "/usr/share/xml/docbook/xsl-stylesheets-1.78.0/html/chunk.xsl"
compilation error: file /usr/share/apps/ksgmltools2/customization/kde-include-common.xsl line 5 element import
xsl:import : unable to load /usr/share/xml/docbook/xsl-stylesheets-1.78.0/html/chunk.xsl
unable to parse /tmp/yaourt-tmp-xxx/aur-kvpm/src/kvpm-0.8.6-pl1/docbook/index.docbook
make[2]: *** [docbook/index.cache.bz2] Error 1
make[1]: *** [docbook/CMakeFiles/docbook-handbook.dir/all] Error 2
---
Directory /usr/share/xml/docbook/xsl-stylesheets-1.78.0 does not exist because I have docbook-xsl 1.78.1-1 which contatin /usr/share/xml/docbook/xsl-stylesheets-1.78.1 directory.

deviousway commented on 2013-03-14 15:41

# Maintainer: Artem Sereda <overmind88@gmail.com>

pkgname=kvpm
pkgver=0.8.6
pkgrel=pl1
pkgdesc="Front end for Linux LVM and Gnu parted. It also handles creating and mounting file systems"
arch=('i686' 'x86_64')
url="http://sourceforge.net/projects/kvpm/"
license=('GPL')
depends=('util-linux-ng' 'parted' 'kdelibs' 'lvm2>=2.02.88' 'udev')
makedepends=('cmake' 'automoc4')
source=(http://downloads.sourceforge.net/${pkgname}/${pkgname}-${pkgver}-${pkgrel}.tar.gz)

build () {
cd ${srcdir}/${pkgname}-${pkgver}-${pkgrel}
mkdir build
cd build
cmake -DKDE4_ENABLE_HTMLHANDBOOK=OFF \
-DCMAKE_INSTALL_PREFIX=`kde4-config --prefix` \
-DCMAKE_BUILD_TYPE=Release ..
make || return 1
make DESTDIR=${pkgdir} install
}

md5sums=('a07547660a621525ecd8d17a7de4b8af')




This PKGBUILD ready for the new version 0.8.6-1Pl, a developer, I wrote

deviousway commented on 2013-03-14 15:39

# Maintainer: Artem Sereda <overmind88@gmail.com>

pkgname=kvpm
pkgver=0.8.6
pkgrel=pl1
pkgdesc="Front end for Linux LVM and Gnu parted. It also handles creating and mounting file systems"
arch=('i686' 'x86_64')
url="http://sourceforge.net/projects/kvpm/"
license=('GPL')
depends=('util-linux-ng' 'parted' 'kdelibs' 'lvm2>=2.02.88' 'udev')
makedepends=('cmake' 'automoc4')
source=(http://downloads.sourceforge.net/${pkgname}/${pkgname}-${pkgver}-${pkgrel}.tar.gz)

build () {
cd ${srcdir}/${pkgname}-${pkgver}-${pkgrel}
mkdir build
cd build
cmake -DKDE4_ENABLE_HTMLHANDBOOK=OFF \
-DCMAKE_INSTALL_PREFIX=`kde4-config --prefix` \
-DCMAKE_BUILD_TYPE=Release ..
make || return 1
make DESTDIR=${pkgdir} install
}

md5sums=('a07547660a621525ecd8d17a7de4b8af')











Aerion commented on 2013-02-05 15:49

The package fails to build with the following error:

[ 35%] Building CXX object kvpm/CMakeFiles/kvpm.dir/main.o
/tmp/packerbuild-1000/kvpm/kvpm/src/kvpm-0.8.6/kvpm/main.cpp: In function ‘int main(int, char**)’:
/tmp/packerbuild-1000/kvpm/kvpm/src/kvpm-0.8.6/kvpm/main.cpp:49:17: error: ‘geteuid’ was not declared in this scope
make[2]: *** [kvpm/CMakeFiles/kvpm.dir/main.o] Error 1
make[1]: *** [kvpm/CMakeFiles/kvpm.dir/all] Error 2
make: *** [all] Error 2
==> ERROR: A failure occurred in build().
Aborting...
The build failed.

Anonymous comment on 2012-05-11 01:23

It fails to build 0.8.6 with this error. http://pastebin.com/ce1YgdgY

arcticblaze commented on 2012-03-17 08:58

v0.8.5 is out. I have managed to install it. The updated PKGBUILD is here: http://pastebin.com/WhShmPq4

artemklevtsov commented on 2011-08-06 20:39

I can't build it: http://pastebin.com/CcdSyBUi
kvpm-svn build success.

--
Aecc x86_64

All comments