Package Details: lib32-gnome-vfs 2.24.4-11

Git Clone URL: https://aur.archlinux.org/lib32-gnome-vfs.git (read-only)
Package Base: lib32-gnome-vfs
Description: The GNOME Virtual File System (32 bit)
Upstream URL: http://www.gnome.org
Licenses: LGPL
Submitter: None
Maintainer: mordervomubel
Last Packager: mordervomubel
Votes: 19
Popularity: 0.000496
First Submitted: 2008-09-02 16:43
Last Updated: 2015-06-26 19:29

Required by (0)

Sources (5)

Latest Comments

mordervomubel commented on 2015-05-22 03:28

Good idea... I should have checked the official gnome-vfs before going off on a hunt for older gnutls. Thanks for the tip.

I updated the PKGBUILD to combine official gnome-vfs with the 32-bit specific stuff and am calling it release 11. Dependency to lib32-gnutls28 set back to lib32-gnutls. It builds fine, but I don't have a way to test it right now.

If it breaks anything, please let me know =)

Lertets commented on 2015-05-21 17:13

I appreciate the fix. I definitely use it and anybody using CodeComposer studio for embedded development would require it as well.

Just an FYI there's a patch available that I used to fix my problem its available in the official package.
https://projects.archlinux.org/svntogit/packages.git/tree/trunk?h=packages/gnome-vfs

mordervomubel commented on 2015-05-21 04:37

Should be fixed now. It looks like gnutls updated:

[2015-05-06 11:55] [ALPM] upgraded lib32-gnutls (3.3.13-1 -> 3.4.0-2)

I changed the dependency to lib32-gnutls28, since that's the last version that seems to work with gnome-vfs, and since the package already exists in AUR.

New PKGBUILD (release 10) should fix everything. Only took me about an hour or so. I guess I see why the last maintainer orphaned the package. This thing isn't maintained anymore upstream.

By the way, is anyone actively using this? I'm curious what requires it. I only took over because I was trying to get Lotus Notes working in Arch Linux.

Lertets commented on 2015-05-03 14:46

Having an issue compiling it, it fails with the following message

/tmp/yaourt-tmp-roqueo/aur-lib32-gnome-vfs/src/gnome-vfs-2.24.4/libgnomevfs/.libs/libgnomevfs-2.so: undefined reference to `gnutls_cipher_set_priority'
/tmp/yaourt-tmp-roqueo/aur-lib32-gnome-vfs/src/gnome-vfs-2.24.4/libgnomevfs/.libs/libgnomevfs-2.so: undefined reference to `gnutls_compression_set_priority'
/tmp/yaourt-tmp-roqueo/aur-lib32-gnome-vfs/src/gnome-vfs-2.24.4/libgnomevfs/.libs/libgnomevfs-2.so: undefined reference to `gnutls_kx_set_priority'
/tmp/yaourt-tmp-roqueo/aur-lib32-gnome-vfs/src/gnome-vfs-2.24.4/libgnomevfs/.libs/libgnomevfs-2.so: undefined reference to `gnutls_protocol_set_priority'
/tmp/yaourt-tmp-roqueo/aur-lib32-gnome-vfs/src/gnome-vfs-2.24.4/libgnomevfs/.libs/libgnomevfs-2.so: undefined reference to `gnutls_mac_set_priority'
collect2: error: ld returned 1 exit status
Makefile:578: recipe for target 'gnome-vfs-daemon' failed
make[2]: *** [gnome-vfs-daemon] Error 1
make[2]: Leaving directory '/tmp/yaourt-tmp-roqueo/aur-lib32-gnome-vfs/src/gnome-vfs-2.24.4/daemon'
Makefile:615: recipe for target 'all-recursive' failed
make[1]: *** [all-recursive] Error 1
make[1]: Leaving directory '/tmp/yaourt-tmp-roqueo/aur-lib32-gnome-vfs/src/gnome-vfs-2.24.4'
Makefile:518: recipe for target 'all' failed
make: *** [all] Error 2

danfly09 commented on 2015-04-19 15:14

I vote for this package and all its dependencies should be on official repositorys.

kyak commented on 2014-12-12 19:46

This patch fixes it:
http://lists.opensuse.org/opensuse-commit/2014-01/msg00453.html

Or,
export CC='gcc -m32 -Dg_memmove=memmove'
export CXX='g++ -m32 -Dg_memmove=memmove'
in build()

kyak commented on 2014-12-12 19:38

It wouldn't build.. It all comes down to undefined reference to `g_memmove'

rafaelff commented on 2013-05-25 00:30

Thanks for the reply, @trovao. PKGBUILD fixed in 2.24.4-8

trovao commented on 2013-05-24 12:06

@josephgbr Hum, actually, I still need it. It will build fine if you apply this patch: http://trac.macports.org/attachment/ticket/38657/patch-port-glib2-2.6.31-and-up.diff

A bit of context: http://trac.macports.org/ticket/38657

rafaelff commented on 2013-05-18 15:07

@seanl: This package seems to be too much deprecated (it won't even build!). Do you see any problem in me requesting deletion of this package?

All comments