Package Details: lib32-libwbclient 4.6.7-1

Git Clone URL: https://aur.archlinux.org/lib32-smbclient.git (read-only)
Package Base: lib32-smbclient
Description: Samba winbind client library
Upstream URL: http://www.samba.org
Licenses: GPL3
Submitter: rafaelff
Maintainer: rafaelff
Last Packager: rafaelff
Votes: 17
Popularity: 1.317956
First Submitted: 2015-06-11 14:22
Last Updated: 2017-08-22 16:10

Latest Comments

rafaelff commented on 2017-08-27 13:19

@kyndek: I'm unable to reproduce.. Can you please provide both the full build output and the file src/samba-4.6.7/bin/config.log, in a pastebin site (See https://wiki.archlinux.org/index.php/List_of_applications#Pastebin_clients)

kyndek commented on 2017-08-25 09:32

I am getting the following error whilst trying to build:
Dynconfig[CONFIGDIR]: : '/etc/samba'
Checking for third party Python module dns.resolver : Traceback (most recent call last):
File "./buildtools/bin/waf", line 76, in <module>
Scripting.prepare(t, cwd, VERSION, wafdir)
File "/tmp/pamac-build-kyndek/lib32-smbclient/src/samba-4.6.7/third_party/waf/wafadmin/Scripting.py", line 145, in prepare
prepare_impl(t, cwd, ver, wafdir)
File "/tmp/pamac-build-kyndek/lib32-smbclient/src/samba-4.6.7/third_party/waf/wafadmin/Scripting.py", line 135, in prepare_impl
main()
File "/tmp/pamac-build-kyndek/lib32-smbclient/src/samba-4.6.7/wscript", line 350, in main
wildcard_main(wildcard_cmd)
File "./buildtools/wafsamba/samba_wildcard.py", line 110, in wildcard_main
fun(ctx)
File "/tmp/pamac-build-kyndek/lib32-smbclient/src/samba-4.6.7/third_party/waf/wafadmin/Scripting.py", line 241, in configure
conf.sub_config([''])
File "/tmp/pamac-build-kyndek/lib32-smbclient/src/samba-4.6.7/third_party/waf/wafadmin/Configure.py", line 237, in sub_config
self.recurse(k, name='configure')
File "/tmp/pamac-build-kyndek/lib32-smbclient/src/samba-4.6.7/third_party/waf/wafadmin/Utils.py", line 656, in recurse
f(self)
File "/tmp/pamac-build-kyndek/lib32-smbclient/src/samba-4.6.7/wscript", line 128, in configure
conf.RECURSE('third_party')
File "./buildtools/wafsamba/samba_utils.py", line 451, in RECURSE
return ctx.sub_config(relpath)
File "/tmp/pamac-build-kyndek/lib32-smbclient/src/samba-4.6.7/third_party/waf/wafadmin/Configure.py", line 237, in sub_config
self.recurse(k, name='configure')
File "/tmp/pamac-build-kyndek/lib32-smbclient/src/samba-4.6.7/third_party/waf/wafadmin/Utils.py", line 656, in recurse
f(self)
File "/tmp/pamac-build-kyndek/lib32-smbclient/src/samba-4.6.7/third_party/wscript", line 49, in configure
find_third_party_module(conf, module, package)
File "/tmp/pamac-build-kyndek/lib32-smbclient/src/samba-4.6.7/third_party/wscript", line 18, in find_third_party_module
__import__(module)
File "/usr/lib/python2.7/site-packages/dns/resolver.py", line 35, in <module>
import dns.message
File "/usr/lib/python2.7/site-packages/dns/message.py", line 29, in <module>
import dns.entropy
File "/usr/lib/python2.7/site-packages/dns/entropy.py", line 124, in <module>
pool = EntropyPool()
File "/usr/lib/python2.7/site-packages/dns/entropy.py", line 35, in __init__
self.hash = hashlib.sha1()
AttributeError: 'module' object has no attribute 'sha1'

yurikoles commented on 2017-01-02 11:55

Download url is wrong, must be https://www.samba.org/samba/samba/ftp/stable/samba-4.5.2.tar.gz

rafaelff commented on 2016-09-17 00:48

lib32-tdb was updated to 1.3.11; now lib32-smbclient should build without issue.

Nightshaxx commented on 2016-09-16 19:23

Same issue as sharivegas. It looks for tdb >= 1.3.10 but doesn't find it, even though I have tdb 1.3.10-1. If is looking for lib32-tdb (which makes more sense), the latest available is lib32-tdb 1.3.9-1.

rafaelff commented on 2016-09-16 10:03

And lib32-tdb is flagged as out-of-date already.

sharivegas commented on 2016-09-16 09:18

Has a hard dependency on lib32-tdb >1.3.10, latest available is multilib/lib32-tdb 1.3.9-1.

rafaelff commented on 2016-06-13 15:05

@rodrigog83: thanks for the report. I added ldb to lib32-ldb's depends array. Please install the new release of lib32-ldb and try building lib32-smbclient again.

estrod commented on 2016-06-12 22:45

Had to add 'ldb' to makedepend because it complained that 'ldb.h' was not found.

flungo commented on 2016-05-21 11:36

I am getting the following error whilst trying to build:

```
[1668/3833] Compiling source4/libcli/ldap/ldap_controls.c
../source4/libcli/ldap/ldap_controls.c:1259:4: error: ‘LDB_CONTROL_DIRSYNC_EX_OID’ undeclared here (not in a function)
{ LDB_CONTROL_DIRSYNC_EX_OID, decode_dirsync_request, encode_dirsync_request },
^
Waf: Leaving directory `/tmp/yaourt-tmp-flungo/aur-lib32-smbclient/src/samba-4.4.3/bin'
Build failed: -> task failed (err #1):
{task: cc ldap_controls.c -> ldap_controls_1.o}
Makefile:8: recipe for target 'all' failed
make: *** [all] Error 1
```

Any suggestions? Anyone else getting the same?

All comments