Package Details: lib32-sane 1.0.30-1

Git Clone URL: https://aur.archlinux.org/lib32-sane.git (read-only, click to copy)
Package Base: lib32-sane
Description: Scanner Access Now Easy (32 bit)
Upstream URL: http://www.sane-project.org/
Licenses: GPL
Submitter: mirh
Maintainer: mirh
Last Packager: mirh
Votes: 0
Popularity: 0.000000
First Submitted: 2020-03-27 14:54
Last Updated: 2020-05-26 11:42

Latest Comments

mirh commented on 2020-05-26 11:43

At least with gcc 9 it worked fine.. Anyway, new updated version may be better now.

mattf commented on 2020-05-23 22:24

And after I manually added the key, I have the compile error:

CC util.o CC input-rl.o CCLD gdbmtool /usr/bin/ld: ./libgdbmapp.a(parseopt.o):(.bss+0x4): multiple definition of parseopt_program_args'; gdbmtool.o:(.data.rel.local+0x150): first defined here /usr/bin/ld: ./libgdbmapp.a(parseopt.o):(.bss+0x8): multiple definition ofparseopt_program_doc'; gdbmtool.o:(.data.rel.local+0x154): first defined here collect2: error: ld returned 1 exit status make[3]: [Makefile:656: gdbmtool] Error 1 make[3]: Leaving directory '/tmp/yaourt-tmp-matheus/aur-lib32-gdbm/src/gdbm-1.18.1/src' make[2]: [Makefile:499: all] Error 2 make[2]: Leaving directory '/tmp/yaourt-tmp-matheus/aur-lib32-gdbm/src/gdbm-1.18.1/src' make[1]: [Makefile:464: all-recursive] Error 1 make[1]: Leaving directory '/tmp/yaourt-tmp-matheus/aur-lib32-gdbm/src/gdbm-1.18.1' make: [Makefile:396: all] Error 2

mattf commented on 2020-05-23 22:10

I have this pgp signature problem:

-> Downloading kmod-25.tar.sign... % Total % Received % Xferd Average Speed Time Time Time Current Dload Upload Total Spent Left Speed 100 162 100 162 0 0 79 0 0:00:02 0:00:02 --:--:-- 79 100 801 100 801 0 0 226 0 0:00:03 0:00:03 --:--:-- 1181 ==> Validating source files with md5sums... kmod-25.tar.xz ... Passed kmod-25.tar.sign ... Skipped ==> Verifying source file signatures with gpg... kmod-25.tar ... FAILED (unknown public key 9BA2A5A630CBEA53) ==> ERROR: One or more PGP signatures could not be verified! Error downloading sources: lib32-kmod

freenestor commented on 2020-05-13 04:56

solved after installing lib32-curl

freenestor commented on 2020-05-13 03:46

compile error, how to fix it?

/usr/bin/ld: skipping incompatible /usr/lib/gcc/x86_64-pc-linux-gnu/9.3.0/../../../libcurl.so when searching for -lcurl /usr/bin/ld: skipping incompatible /usr/lib/libcurl.so when searching for -lcurl /usr/bin/ld: cannot find -lcurl collect2: error: ld returned 1 exit status make[2]: [Makefile:3804: libsane-escl.la] Error 1 make[2]: Waiting for unfinished jobs.... ar: u' modifier ignored sinceD' is the default (see `U') make[2]: Leaving directory '/tmp/yaourt-tmp-aart/aur-lib32-sane/src/sane-backends-1.0.29/backend' make[1]: [Makefile:3275: all] Error 2 make[1]: Leaving directory '/tmp/yaourt-tmp-aart/aur-lib32-sane/src/sane-backends-1.0.29/backend' make: [Makefile:597: all-recursive] Error 1

Arientar commented on 2020-03-31 09:58

This package depends also on lib32-net-snmp*. Without it, this package wouldn't compile.

*https://aur.archlinux.org/packages/lib32-net-snmp