Package Details: libdap 3.21.0-1

Git Clone URL: (read-only, click to copy)
Package Base: libdap
Description: A library which contains an implementation of DAP 2.0 and 3.1
Upstream URL:
Licenses: LGPL2.1
Submitter: graziano
Maintainer: lmartinez-mirror
Last Packager: lmartinez-mirror
Votes: 4
Popularity: 0.000000
First Submitted: 2006-12-01 13:04 (UTC)
Last Updated: 2024-02-26 03:18 (UTC)

Latest Comments

kkats commented on 2024-07-09 02:22 (UTC)

New source repo?

ArnaudNux commented on 2024-02-26 01:02 (UTC)

New version : (January,24 2024)

yzbsj commented on 2021-05-06 05:02 (UTC)

Change CXXFLAGS="$CFLAGS" in /etc/makepkg.conf to CXXFLAGS="-g3 -O0 -Wall -fno-defer-pop" and then it can pass make check successfully.

yzbsj commented on 2021-04-29 12:04 (UTC)

ERROR: All 130 tests were run, 4 failed unexpectedly.

EXPRTest.log was created.

Please send `tests/EXPRTest.log' and all information you think might help:

To: Subject: [libdap 3.20.5] EXPRTest: 120 122 124 126 failed

You may investigate any problem if you feel able to do so, in which case the test suite provides a good starting point. Its output may be found below `tests/EXPRTest.dir'.

make[3]: [Makefile:1819:check-local] Error 1 make[3]: Leaving directory“~/.cache/yay/libdap/src/libdap-3.20.5/tests” make[2]: [Makefile:1680:check-am] Error 2 make[2]: Leaving directory“~/.cache/yay/libdap/src/libdap-3.20.5/tests” make[1]: [Makefile:2455:check-recursive] Error 1 make[1]: Leaving directory“~/.cache/yay/libdap/src/libdap-3.20.5” make: [Makefile:2749:check] Error 2

zottelef commented on 2016-07-28 10:26 (UTC)

gives error : dds.yy: In function 'int ddsparse(libdap::parser_arg*)': dds.yy:265:15: error: reference to 'array' is ambiguous part = array; ^~~~~ In file included from BaseType.h:55:0, from Byte.h:44, from dds.yy:57: Type.h:50:5: note: candidates are: libdap::Part array array, ^~~~~ In file included from /usr/include/c++/6.1.1/tuple:39:0, from /usr/include/c++/6.1.1/bits/stl_map.h:63, from /usr/include/c++/6.1.1/map:61, from Keywords2.h:30, from DDS.h:66, from Vector.h:43, from Array.h:48, from dds.yy:66: /usr/include/c++/6.1.1/array:90:12: note: template<class _Tp, long unsigned int _Nm> struct std::array struct array ^~~~~ make[2]: *** [Makefile:2133:] Error 1 make[2]: Leaving directory '/tmp/yaourt-tmp-fabio/aur-libdap/src/libdap-3.15.1' make[1]: *** [Makefile:2304: all-recursive] Error 1 make[1]: Leaving directory '/tmp/yaourt-tmp-fabio/aur-libdap/src/libdap-3.15.1' make: *** [Makefile:1184: all] Error 2

Morn commented on 2016-02-15 16:32 (UTC)

bison is also a dependency. And license should be an array.

graziano commented on 2010-09-26 15:21 (UTC)

Proposed new PKGBUILD