Package Details: libdigidoc 3.10.1.1212-1

Git Clone URL: https://aur.archlinux.org/libdigidoc.git (read-only)
Package Base: libdigidoc
Description: Library for creating DigiDoc signature files
Upstream URL: http://www.id.ee/
Keywords: esteid
Licenses: LGPL
Submitter: kevku
Maintainer: kevku
Last Packager: kevku
Votes: 7
Popularity: 0.000337
First Submitted: 2012-12-12 12:05
Last Updated: 2016-02-02 11:20

Latest Comments

Poncho_grande commented on 2017-05-17 11:15

Scanning dependencies of target digidoc
[ 4%] Building C object libdigidoc/CMakeFiles/digidoc.dir/DigiDocConfig.c.o
[ 8%] Building C object libdigidoc/CMakeFiles/digidoc.dir/DigiDocLib.c.o
/tmp/yaourt-tmp-johan/aur-libdigidoc/src/libdigidoc/DigiDocLib.c: In function ‘calculateFileSignature’:
/tmp/yaourt-tmp-johan/aur-libdigidoc/src/libdigidoc/DigiDocLib.c:477:15: error: storage size of ‘ctx’ isn’t known
EVP_MD_CTX ctx;
^~~
/tmp/yaourt-tmp-johan/aur-libdigidoc/src/libdigidoc/DigiDocLib.c: In function ‘signData’:
/tmp/yaourt-tmp-johan/aur-libdigidoc/src/libdigidoc/DigiDocLib.c:538:15: error: storage size of ‘ctx’ isn’t known
EVP_MD_CTX ctx;
^~~
/tmp/yaourt-tmp-johan/aur-libdigidoc/src/libdigidoc/DigiDocLib.c: In function ‘ddocPullUrl’:
/tmp/yaourt-tmp-johan/aur-libdigidoc/src/libdigidoc/DigiDocLib.c:848:28: error: ‘BIO_R_BAD_HOSTNAME_LOOKUP’ undeclared (first use in this function)
if(ERR_GET_REASON(e) == BIO_R_BAD_HOSTNAME_LOOKUP ||
^~~~~~~~~~~~~~~~~~~~~~~~~
/tmp/yaourt-tmp-johan/aur-libdigidoc/src/libdigidoc/DigiDocLib.c:848:28: note: each undeclared identifier is reported only once for each function it appears in
/tmp/yaourt-tmp-johan/aur-libdigidoc/src/libdigidoc/DigiDocLib.c:849:25: error: ‘OCSP_R_SERVER_WRITE_ERROR’ undeclared (first use in this function)
ERR_GET_REASON(e) == OCSP_R_SERVER_WRITE_ERROR)
^~~~~~~~~~~~~~~~~~~~~~~~~
make[2]: *** [libdigidoc/CMakeFiles/digidoc.dir/build.make:87: libdigidoc/CMakeFiles/digidoc.dir/DigiDocLib.c.o] Error 1
make[1]: *** [CMakeFiles/Makefile2:88: libdigidoc/CMakeFiles/digidoc.dir/all] Error 2
make: *** [Makefile:130: all] Error 2
==> ERROR: A failure occurred in build().
Aborting...
==> ERROR: Makepkg was unable to build libdigidoc.


advice?

kristerv commented on 2015-02-17 13:32

kevku, please let me know if you don't know or just don't have the time to fix this. Perhaps I can help.

==> ERROR: One or more PGP signatures could not be verified!
==> ERROR: Makepkg was unable to build libdigidoc.

kristerv commented on 2015-02-17 13:31

kevku, do you know how to fix this or you just don't have the time?

==> ERROR: One or more PGP signatures could not be verified!
==> ERROR: Makepkg was unable to build libdigidoc.