Package Details: libffi-git 3.4.2.r20.g0f2dd36-1

Git Clone URL: https://aur.archlinux.org/libffi-git.git (read-only, click to copy)
Package Base: libffi-git
Description: Portable foreign function interface library
Upstream URL: https://sourceware.org/libffi/
Licenses: MIT
Conflicts: libffi
Provides: libffi, libffi.so
Submitter: Chocobo1
Maintainer: Chocobo1
Last Packager: Chocobo1
Votes: 0
Popularity: 0.000000
First Submitted: 2017-11-04 17:48 (UTC)
Last Updated: 2021-10-16 19:17 (UTC)

Required by (442)

Sources (1)

Latest Comments

Chocobo1 commented on 2021-10-16 19:18 (UTC)

@adamant.pwn

Fixed.

adamant.pwn commented on 2021-10-16 17:35 (UTC) (edited on 2021-10-16 17:39 (UTC) by adamant.pwn)

        === libffi tests ===

Schedule of variations:
    unix

Running target unix
Using /usr/share/dejagnu/baseboards/unix.exp as board description file for target.
Using /usr/share/dejagnu/config/unix.exp as generic interface file for target.
Using ../../testsuite/config/default.exp as tool-and-target-specific interface file.
Running ../../testsuite/libffi.bhaible/bhaible.exp ...
Running ../../testsuite/libffi.call/call.exp ...
FAIL: libffi.call/struct_by_value_big.c -W -Wall -Wno-psabi -O0 -DABI_NUM=FFI_GNUW64 -DABI_ATTR=__MSABI__ execution test
FAIL: libffi.call/struct_by_value_big.c -W -Wall -Wno-psabi -O2 -DABI_NUM=FFI_GNUW64 -DABI_ATTR=__MSABI__ execution test
Running ../../testsuite/libffi.closures/closure.exp ...
Running ../../testsuite/libffi.complex/complex.exp ...
Running ../../testsuite/libffi.go/go.exp ...

        === libffi Summary ===

# of expected passes        2318
# of unexpected failures    2
make[3]: *** [Makefile:457: check-DEJAGNU] Error 1
make[3]: Leaving directory '/home/adamant/.cache/yay/libffi-git/src/libffi/x86_64-pc-linux-gnu/testsuite'
make[2]: *** [Makefile:533: check-am] Error 2
make[2]: Leaving directory '/home/adamant/.cache/yay/libffi-git/src/libffi/x86_64-pc-linux-gnu/testsuite'
make[1]: *** [Makefile:1377: check-recursive] Error 1
make[1]: Leaving directory '/home/adamant/.cache/yay/libffi-git/src/libffi/x86_64-pc-linux-gnu'
make: *** [Makefile:3066: check] Error 2
==> ERROR: A failure occurred in check().
    Aborting...
 -> error making: libffi-git