Package Details: libgnome-data 2.32.1-8

Git Clone URL: https://aur.archlinux.org/libgnome.git (read-only, click to copy)
Package Base: libgnome
Description: Common data from libgnome
Upstream URL: http://www.gnome.org
Licenses: LGPL
Submitter: PhotonX
Maintainer: PhotonX
Last Packager: PhotonX
Votes: 57
Popularity: 0.060026
First Submitted: 2017-01-26 07:39
Last Updated: 2021-03-28 18:12

Latest Comments

1 2 Next › Last »

PhotonX commented on 2021-03-30 19:29

@JohnRobson, I just checked and the sha256sum is still correct. I don't understand why it fails for you. Could you please post the sha256sum of your libgnome-2.32.1.tar.bz2 file?

PhotonX commented on 2021-03-30 15:23

That's weird, I didn't change the source file's sha256sum, so it seems that the file has been modified upstream... I will have a look into it.

JohnRobson commented on 2021-03-30 14:58

==> Validating source files with sha256sums...
libgnome-2.32.1.tar.bz2 ... FAILED
0001-Don-t-use-G_DISABLE_DEPRECATED.patch ... Passed
05_glib-2.54-ftbfs.patch ... Passed
==> ERROR: One or more files did not pass the validity check!
error downloading sources: libgnome (libgnome-data libgnome)

PhotonX commented on 2021-03-28 18:12

Thanks, done!

rafaelff commented on 2021-03-28 14:22

Please add gtk-doc to makedepends in order to solve this:

Can't exec "gtkdocize": No such file or directory at /usr/share/autoconf/Autom4te/FileUtils.pm line 293.
autoreconf: error: gtkdocize failed with exit status: 2

PhotonX commented on 2017-11-04 12:38

@Akidso: Could you please post the complete error output you are getting? The two outputs you posted are completely different. :)

Adikso commented on 2017-11-04 12:33

@PhotonX It happens during build of libgnome:
Traceback (most recent call last):
[...]
UnicodeDecodeError: 'ascii' codec can't decode byte 0xc2 in position 2123: ordinal not in range(128)
make[2]: *** [Makefile:691: install-data-local] Error 1
make[2]: Leaving directory '/tmp/yaourt-tmp-adikso/aur-libgnome/src/libgnome-2.32.1/doc/reference'
make[1]: *** [Makefile:469: install-am] Error 2
make[1]: Leaving directory '/tmp/yaourt-tmp-adikso/aur-libgnome/src/libgnome-2.32.1/doc/reference'
make: *** [Makefile:399: install-recursive] Error 1
make: Leaving directory '/tmp/yaourt-tmp-adikso/aur-libgnome/src/libgnome-2.32.1/doc'

PhotonX commented on 2017-11-02 20:34

@Adikso: Unfortunately, I'm not able to reproduce this. Are you sure that this output comes when building libgnome and not some of its dependencies?

Adikso commented on 2017-11-02 14:26

I am getting this error during building:

Traceback (most recent call last):
File "/usr/bin/gtkdoc-rebase", line 56, in <module>
sys.exit(rebase.run(options))
File "/usr/share/gtk-doc/python/gtkdoc/rebase.py", line 73, in run
ScanDirectory(dir, options)
File "/usr/share/gtk-doc/python/gtkdoc/rebase.py", line 131, in ScanDirectory
ScanDirectory(subdir, options)
File "/usr/share/gtk-doc/python/gtkdoc/rebase.py", line 104, in ScanDirectory
o = ReadDevhelp(scan_dir, entry)
File "/usr/share/gtk-doc/python/gtkdoc/rebase.py", line 137, in ReadDevhelp
for line in open(os.path.join(dir, file)):
File "/usr/lib/python3.6/encodings/ascii.py", line 26, in decode
return codecs.ascii_decode(input, self.errors)[0]
UnicodeDecodeError: 'ascii' codec can't decode byte 0xc2 in position 2123: ordinal not in range(128)

PhotonX commented on 2017-10-11 12:51

Finally had the time to look into it, the bug is fixed using the patch from https://bugs.debian.org/cgi-bin/bugreport.cgi?bug=870742