Package Details: libgtkhtml 2.11.1-7

Git Clone URL: https://aur.archlinux.org/libgtkhtml.git (read-only)
Package Base: libgtkhtml
Description: An HTML library for GTK
Upstream URL: http://www.gnome.org
Licenses: GPL
Submitter: jose1711
Maintainer: jose1711
Last Packager: jose1711
Votes: 7
Popularity: 0.007820
First Submitted: 2015-12-11 13:29
Last Updated: 2018-01-25 22:24

Latest Comments

« First ‹ Previous 1 2

Harey commented on 2017-09-21 13:13

No, I haven't, as it is not listed as a dependency. After building and installing gnome-vfs-nosmb (which by the way pulled in another bunch of dependencies) the build process is working.

jose1711 commented on 2017-09-21 12:54

i may be missing a dependency. have you got gnome-vfs-nosmb installed?

Harey commented on 2017-09-19 07:13

does not build...

/bin/ld: skipping incompatible /usr/lib/gcc/x86_64-pc-linux-gnu/7.2.0/../../../libgnomevfs-2.so when searching for -lgnomevfs-2
/bin/ld: skipping incompatible /usr/lib/libgnomevfs-2.so when searching for -lgnomevfs-2
/bin/ld: cannot find -lgnomevfs-2
/bin/ld: skipping incompatible /usr/lib/gcc/x86_64-pc-linux-gnu/7.2.0/../../../libgconf-2.so when searching for -lgconf-2
/bin/ld: skipping incompatible /usr/lib/libgconf-2.so when searching for -lgconf-2
/bin/ld: cannot find -lgconf-2
collect2: error: ld returned 1 exit status
make[3]: *** [Makefile:304: testgtkhtml] Error 1
make[3]: Leaving directory '/home/harvey/abs/local/lib32-libgtkhtml/src/libgtkhtml-2.11.1/tests'
make[2]: *** [Makefile:356: all-recursive] Error 1
make[2]: Leaving directory '/home/harvey/abs/local/lib32-libgtkhtml/src/libgtkhtml-2.11.1/tests'
make[1]: *** [Makefile:308: all-recursive] Error 1
make[1]: Leaving directory '/home/harvey/abs/local/lib32-libgtkhtml/src/libgtkhtml-2.11.1'
make: *** [Makefile:219: all] Error 2
==> ERROR: A failure occurred in build().
Aborting...