Package Details: libowfat 0.31-1

Git Clone URL: (read-only)
Package Base: libowfat
Description: GPL reimplementation of libdjb
Upstream URL:
Licenses: GPL
Conflicts: tinycdb
Submitter: None
Maintainer: phects
Last Packager: phects
Votes: 26
Popularity: 0.139117
First Submitted: 2006-10-16 18:54
Last Updated: 2016-10-16 13:51

Latest Comments

« First ‹ Previous 1 2 3 Next › Last »

Zeniff commented on 2012-03-07 00:02

Finally got it to build on a nearly-year-old small Arch installation I had on usb! :D Strange that it did not build on 2 other up-to-date Arch systems which both had tons more packages... Wonder why? Nothing else was different... Oh well, lucky I never updated that one, I guess~ Thanks for the hint to try on another system! :)

encbladexp commented on 2012-03-04 14:23

I don't know, but on my system (without installed dietlibc) it works very well.

Zeniff commented on 2012-03-04 11:13

Thanks for answering! But, I'm confused, I've tried the PKBUILD from again, but I still get the same error? Is there some step I'm missing? Sorry~ o.o

encbladexp commented on 2012-03-04 09:17

Hi Zeniff, please check my AUR Repository again ( ), i have fixed this issue in dezember ;-)

Zeniff commented on 2012-03-04 01:52

Hi! Thanks for the fix! But, I'm still getting the havescope.h error (same as thpetrus had) after trying encbladexp's PKGBUILD (and cmb's fix doesn't seem to be online anymore). :(

encbladexp commented on 2011-12-06 16:24

Finally fixed in my aur Repository. Thanks to fefe!

encbladexp commented on 2011-12-06 15:19

Here is a fixed Version of this PKGBUILD, with havescope.h Patch included:

cmb commented on 2011-09-30 19:28

Here's the problem with havescope.h.
socket_remote4.c #includes it, but it is not specified as a dependency
in GNUmakefile.
So the havescope.h header file is not built before socket_remote4.c is
compiled. In fact, the inclusion of havescope.h by socket_remote4.c
is superfluous. Look at upstream's CVS repo, and you'll see that it has
been dropped.
Here is the updated PKGBUILD, along with a patch:

Anonymous comment on 2011-09-20 16:59

Same error for me:

socket/socket_remote4.c:11:23: fatal error: havescope.h: No such file or directory
compilation terminated.
make: *** [socket_remote4.o] Error 1
==> ERROR: A failure occurred in build().

Would appreciate a fix. Thank you in advance

Kev commented on 2011-09-08 23:06

/opt/diet/bin/diet -Os gcc -c socket/socket_broadcast.c -pipe -W -Wall -O2 -fomit-frame-pointer -D_REENTRANT -I.
socket/socket_remote4.c:11:23: schwerwiegender Fehler: havescope.h: Datei oder Verzeichnis nicht gefunden
Kompilierung beendet.
make: *** [socket_remote4.o] Fehler 1
make: *** Warte auf noch nicht beendete Prozesse...

please correct pkgfile.