Package Details: libpurple-meanwhile 2.10.12-1

Git Clone URL: https://aur.archlinux.org/libpurple-meanwhile.git (read-only)
Package Base: libpurple-meanwhile
Description: Pidgin Instant Messenger plugin for Sametime support
Upstream URL: http://pidgin.im/
Licenses: GPL
Provides: libpurple-meanwhile
Submitter: viniavila
Maintainer: mordervomubel
Last Packager: mordervomubel
Votes: 7
Popularity: 0.000000
First Submitted: 2010-12-06 16:46
Last Updated: 2016-02-11 00:49

Latest Comments

« First ‹ Previous 1 2 3 4 Next › Last »

viniavila commented on 2013-11-05 16:09

I'm not using this package anymore, so I'm disowning this package now. Take it if you want to support it.

viniavila commented on 2013-07-08 16:14

I've confirmed this worked. Package updated.

But there is a serious issue. Sometimes when I login, my contact list become empty! I have to add all my contacts again. If I connect with pidgin and get the list empty and after I try connect to Lotus Notes messenger, the list is still empty.

To be warned of that.
Regards,
viniavila

Anonymous comment on 2013-07-08 12:20

Confirmed working by commenting out the port-to-farstream-v3.patch

BeepDog commented on 2013-06-14 15:35

Could probably fix it by not including the port-to-farstream-v3.patch

zdjm commented on 2013-06-10 18:56

anything?

zbito commented on 2013-06-07 12:36

same problem with update for me:
patching file configure.ac
Hunk #1 FAILED at 780.
Hunk #2 FAILED at 802.
2 out of 2 hunks FAILED -- saving rejects to file configure.ac.rej
patching file libpurple/Makefile.am
Reversed (or previously applied) patch detected! Skipping patch.
2 out of 2 hunks ignored -- saving rejects to file libpurple/Makefile.am.rej
patching file libpurple/media/backend-fs2.c
Reversed (or previously applied) patch detected! Skipping patch.
23 out of 23 hunks ignored -- saving rejects to file libpurple/media/backend-fs2.c.rej
patching file libpurple/media.c
Reversed (or previously applied) patch detected! Skipping patch.
2 out of 2 hunks ignored -- saving rejects to file libpurple/media.c.rej
patching file libpurple/mediamanager.c
patch unexpectedly ends in middle of line
Hunk #1 FAILED at 39.
1 out of 1 hunk FAILED -- saving rejects to file libpurple/mediamanager.c.rej
==> BŁĄD: Wystąpił błąd w build().
Przerywam...
==> ERROR: Makepkg was unable to build libpurple-meanwhile.

zdjm commented on 2013-06-06 13:23

getting this error when tryin to update!

==> Starting build()...
patching file configure.ac
Hunk #1 FAILED at 780.
Hunk #2 FAILED at 802.
2 out of 2 hunks FAILED -- saving rejects to file configure.ac.rej
patching file libpurple/Makefile.am
Reversed (or previously applied) patch detected! Skipping patch.
2 out of 2 hunks ignored -- saving rejects to file libpurple/Makefile.am.rej
patching file libpurple/media/backend-fs2.c
Reversed (or previously applied) patch detected! Skipping patch.
23 out of 23 hunks ignored -- saving rejects to file libpurple/media/backend-fs2.c.rej
patching file libpurple/media.c
Reversed (or previously applied) patch detected! Skipping patch.
2 out of 2 hunks ignored -- saving rejects to file libpurple/media.c.rej
patching file libpurple/mediamanager.c
patch unexpectedly ends in middle of line
Hunk #1 FAILED at 39.
1 out of 1 hunk FAILED -- saving rejects to file libpurple/mediamanager.c.rej
==> ERROR: A failure occurred in build().
Aborting...
==> ERROR: Makepkg was unable to build libpurple-meanwhile.

viniavila commented on 2013-06-05 16:54

Uploaded.

viniavila commented on 2012-05-07 12:00

you are trying to compile meanwhile (https://aur.archlinux.org/packages.php?ID=2956) package, not libpurple-meanwhile (yaourt solve dependencies automatically). There was a change in GLib, and you can't include all glib headers anymore, only few headers (check GLib documentation), and the main header <glib.h>. At meanwhile comments, there is a patched PKGBUILD that change the necessary lines (basically glib.h includes) to compile meanwhile correctly. You can download it here: http://codezen.org/static/meanwhile.tar.gz. Download, build and install it with makepkg -si, then reinstall this package.

BTW, I have a problem in Empathy. I Verifyed that Empathy needs gnome-keyring-daemon activated (I use LXDE, so it wad disabled). Editing /etc/xdg/lxsession/LXDE/autostart and adding a "@gnome-keyring-daemon" (without quotes) line, solve this problem.

Anonymous comment on 2012-05-06 02:54

I cannot compile the package. The error message is as below.
BTW, nm, tck and tk are disabled during compiling time.

Making install in sametime
make[3]: Entering directory `/tmp/yaourt-tmp-roylez/aur-libpurple-meanwhile/src/pidgin-2.10.3/libpurple/protocols/sametime'
CC libsametime_la-sametime.lo
In file included from /usr/include/meanwhile/mw_srvc_conf.h:25:0,
from sametime.c:57:
/usr/include/glib-2.0/glib/glist.h:28:2: error: #error "Only <glib.h> can be included directly."
In file included from /usr/include/meanwhile/mw_srvc_place.h:25:0,
from sametime.c:60:
/usr/include/glib-2.0/glib/glist.h:28:2: error: #error "Only <glib.h> can be included directly."
In file included from /usr/include/meanwhile/mw_srvc_resolve.h:26:0,
from sametime.c:61:
/usr/include/glib-2.0/glib/glist.h:28:2: error: #error "Only <glib.h> can be included directly."
In file included from /usr/include/meanwhile/mw_st_list.h:32:0,
from sametime.c:63:
/usr/include/glib-2.0/glib/glist.h:28:2: error: #error "Only <glib.h> can be included directly."
sametime.c: In function 'blist_merge':
sametime.c:989:16: warning: variable 'buddy' set but not used [-Wunused-but-set-variable]
sametime.c: In function 'blist_node_menu_cb':
sametime.c:1340:16: warning: variable 'group' set but not used [-Wunused-but-set-variable]
sametime.c: In function 'mw_conf_peer_joined':
sametime.c:2033:21: warning: variable 'gc' set but not used [-Wunused-but-set-variable]
sametime.c: In function 'mw_conf_peer_parted':
sametime.c:2059:21: warning: variable 'gc' set but not used [-Wunused-but-set-variable]
sametime.c: In function 'mw_place_peerJoined':
sametime.c:3053:21: warning: variable 'gc' set but not used [-Wunused-but-set-variable]
sametime.c: In function 'mw_place_peerParted':
sametime.c:3078:21: warning: variable 'gc' set but not used [-Wunused-but-set-variable]
make[3]: *** [libsametime_la-sametime.lo] Error 1
make[3]: Leaving directory `/tmp/yaourt-tmp-roylez/aur-libpurple-meanwhile/src/pidgin-2.10.3/libpurple/protocols/sametime'
make[2]: *** [install-recursive] Error 1
make[2]: Leaving directory `/tmp/yaourt-tmp-roylez/aur-libpurple-meanwhile/src/pidgin-2.10.3/libpurple/protocols'
make[1]: *** [install-recursive] Error 1
make[1]: Leaving directory `/tmp/yaourt-tmp-roylez/aur-libpurple-meanwhile/src/pidgin-2.10.3/libpurple'
make: *** [install] Error 2
make: Leaving directory `/tmp/yaourt-tmp-roylez/aur-libpurple-meanwhile/src/pidgin-2.10.3/libpurple'