Package Details: libretro-uae-git 443.be625e3-1

Git Clone URL: https://aur.archlinux.org/libretro-uae-git.git (read-only, click to copy)
Package Base: libretro-uae-git
Description: A port of the Commodore Amiga Emulator to libretro (WIP)
Upstream URL: https://github.com/libretro/libretro-uae
Keywords: amiga retroarch uae
Licenses: GPL3
Submitter: quellen
Maintainer: quellen
Last Packager: quellen
Votes: 0
Popularity: 0.000000
First Submitted: 2017-11-26 22:01 (UTC)
Last Updated: 2018-04-12 10:43 (UTC)

Latest Comments

carlosfritz commented on 2022-07-03 20:10 (UTC)

@jfk, this fixed it for me: https://github.com/libretro/libretro-uae/pull/529

tpaniaki commented on 2022-04-14 12:21 (UTC)

Hi, got a syntax error with sources/src/audio.c:46:

/usr/include/bits/mathcalls.h:133:1: erreur: expected « ; » before « extern »
  133 | __MATHCALL_VEC (log2,, (_Mdouble_ __x));
      | ^~~~~~~~~~~~~~
/usr/include/bits/mathcalls.h:133:1: erreur: expected « ; » before « extern »
  133 | __MATHCALL_VEC (log2,, (_Mdouble_ __x));
      | ^~~~~~~~~~~~~~
/usr/include/bits/mathcalls.h:133:1: erreur: expected « ; » before « extern »
  133 | __MATHCALL_VEC (log2,, (_Mdouble_ __x));
      | ^~~~~~~~~~~~~~
/usr/include/bits/mathcalls.h:133:1: erreur: expected « ; » before « extern »
  133 | __MATHCALL_VEC (log2,, (_Mdouble_ __x));
      | ^~~~~~~~~~~~~~
/usr/include/bits/mathcalls.h:133:1: erreur: expected « ; » before « extern »
  133 | __MATHCALL_VEC (log2,, (_Mdouble_ __x));
      | ^~~~~~~~~~~~~~
/usr/include/bits/mathcalls.h:133:1: erreur: expected « ; » before « extern »
  133 | __MATHCALL_VEC (log2,, (_Mdouble_ __x));
      | ^~~~~~~~~~~~~~
/usr/include/bits/mathcalls.h:133:1: erreur: expected « ; » before « extern »
  133 | __MATHCALL_VEC (log2,, (_Mdouble_ __x));
      | ^~~~~~~~~~~~~~
/usr/include/bits/mathcalls.h:133:1: erreur: expected « ; » before « extern »
  133 | __MATHCALL_VEC (log2,, (_Mdouble_ __x));
      | ^~~~~~~~~~~~~~
make: *** [Makefile:325 : sources/src/audio.o] Erreur 1

carlosfritz commented on 2020-10-30 20:17 (UTC)

I created a patch and updated the PKGBUILD so it compiles again.

ArthurBorsboom commented on 2020-07-25 11:29 (UTC)

collect2: error: ld returned 1 exit status make: *** [Makefile:284: puae_libretro.so] Error 1 ==> ERROR: A failure occurred in build(). Aborting...