Package Details: libticalcs 1.1.9-1

Git Clone URL: https://aur.archlinux.org/libticalcs.git (read-only, click to copy)
Package Base: libticalcs
Description: TI Calculator library
Upstream URL: http://lpg.ticalc.org/prj_tilp/
Keywords: ti tiemu tilem
Licenses: GPL
Submitter: blinxwang
Maintainer: J5lx
Last Packager: J5lx
Votes: 23
Popularity: 0.006741
First Submitted: 2015-08-26 20:56 (UTC)
Last Updated: 2017-05-30 21:45 (UTC)

Latest Comments

VorpalGun commented on 2023-01-20 21:37 (UTC)

Hi, when I try to build this I get:

==> ERROR: libticalcs is not available for the 'pentium4' architecture.

I'm using the pentium4 architecture from https://archlinux32.org/architecture/

Could you please add that to arch?

J5lx commented on 2021-05-31 21:39 (UTC)

This package is still up-to-date. The 1.18 tag is only the corresponding TiLP version, but the libraries are versioned separately. Take a look at the configure.ac file for the 1.18 tag and you'll see that the version there is the exact same as on this package. And however upstream decides to organise their VCS repo(s) or where to host them is completely irrelevant for this package since it isn’t built from the VCS repo(s) anyway, it’s built from the release tarballs. Therefore I’m removing the out-of-date flag, please notify me again once upstream has actually made a new release.

aviallon commented on 2021-05-25 13:08 (UTC)

New VCS repo is on git: https://github.com/debrouxl/tilibs The last tag is 1.18. Moreover, the author says that the ancient, separated repos libti{cables,conv,...} are outdated.

zman0900 commented on 2017-06-22 11:14 (UTC)

I think dependency should specify libticables version >= 1.3.5. I got an error when upgrading with pacaur: configure: error: Package requirements (ticables2 >= 1.3.5) were not met: Requested 'ticables2 >= 1.3.5' but version of TiCables is 1.3.4

Ketchup901 commented on 2017-06-11 20:14 (UTC)

Very similar thing happens here as on aur/tilp. make[1]: Entering directory '/home/adam/.cache/pacaur/libticalcs/src/libticalcs2-1.1.9' Making all in build/mingw make[2]: Entering directory '/home/adam/.cache/pacaur/libticalcs/src/libticalcs2-1.1.9/build/mingw' make[2]: Nothing to be done for 'all'. make[2]: Leaving directory '/home/adam/.cache/pacaur/libticalcs/src/libticalcs2-1.1.9/build/mingw' Making all in po make[2]: Entering directory '/home/adam/.cache/pacaur/libticalcs/src/libticalcs2-1.1.9/po' make[2]: Leaving directory '/home/adam/.cache/pacaur/libticalcs/src/libticalcs2-1.1.9/po' Making all in src make[2]: Entering directory '/home/adam/.cache/pacaur/libticalcs/src/libticalcs2-1.1.9/src' make all-recursive make[3]: Entering directory '/home/adam/.cache/pacaur/libticalcs/src/libticalcs2-1.1.9/src' Making all in tf2hex make[4]: Entering directory '/home/adam/.cache/pacaur/libticalcs/src/libticalcs2-1.1.9/src/tf2hex' make[4]: Nothing to be done for 'all'. make[4]: Leaving directory '/home/adam/.cache/pacaur/libticalcs/src/libticalcs2-1.1.9/src/tf2hex' Making all in romdump_8x make[4]: Entering directory '/home/adam/.cache/pacaur/libticalcs/src/libticalcs2-1.1.9/src/romdump_8x' make[4]: Nothing to be done for 'all'. make[4]: Leaving directory '/home/adam/.cache/pacaur/libticalcs/src/libticalcs2-1.1.9/src/romdump_8x' Making all in romdump_84p_usb make[4]: Entering directory '/home/adam/.cache/pacaur/libticalcs/src/libticalcs2-1.1.9/src/romdump_84p_usb' make[4]: Nothing to be done for 'all'. make[4]: Leaving directory '/home/adam/.cache/pacaur/libticalcs/src/libticalcs2-1.1.9/src/romdump_84p_usb' Making all in romdump_834pce_usb make[4]: Entering directory '/home/adam/.cache/pacaur/libticalcs/src/libticalcs2-1.1.9/src/romdump_834pce_usb' make[4]: Nothing to be done for 'all'. make[4]: Leaving directory '/home/adam/.cache/pacaur/libticalcs/src/libticalcs2-1.1.9/src/romdump_834pce_usb' Making all in romdump_9x make[4]: Entering directory '/home/adam/.cache/pacaur/libticalcs/src/libticalcs2-1.1.9/src/romdump_9x' make[4]: Nothing to be done for 'all'. make[4]: Leaving directory '/home/adam/.cache/pacaur/libticalcs/src/libticalcs2-1.1.9/src/romdump_9x' Making all in romdump_89t_usb make[4]: Entering directory '/home/adam/.cache/pacaur/libticalcs/src/libticalcs2-1.1.9/src/romdump_89t_usb' make[4]: Nothing to be done for 'all'. make[4]: Leaving directory '/home/adam/.cache/pacaur/libticalcs/src/libticalcs2-1.1.9/src/romdump_89t_usb' make[4]: Entering directory '/home/adam/.cache/pacaur/libticalcs/src/libticalcs2-1.1.9/src' /bin/sh ../libtool --tag=CC --mode=link gcc -Wall -W -march=x86-64 -mtune=generic -O2 -pipe -fstack-protector-strong -D__LINUX__ -fvisibility=hidden -no-undefined -version-info 12:3:0 -Wl,-O1,--sort-common,--as-needed,-z,relro -o libticalcs2.la -rpath /usr/lib libticalcs2_la-backup.lo libticalcs2_la-calc_00.lo libticalcs2_la-calc_xx.lo libticalcs2_la-calc_73.lo libticalcs2_la-calc_8x.lo libticalcs2_la-calc_9x.lo libticalcs2_la-calc_84p.lo libticalcs2_la-calc_89t.lo libticalcs2_la-calc_nsp.lo libticalcs2_la-clock.lo libticalcs2_la-cmdz80.lo libticalcs2_la-cmd68k.lo libticalcs2_la-dusb_cmd.lo libticalcs2_la-nsp_cmd.lo libticalcs2_la-dirlist.lo libticalcs2_la-error.lo libticalcs2_la-keys73.lo libticalcs2_la-keys83.lo libticalcs2_la-keys83p.lo libticalcs2_la-keys86.lo libticalcs2_la-keys89.lo libticalcs2_la-keys92p.lo libticalcs2_la-dbus_pkt.lo libticalcs2_la-dusb_rpkt.lo libticalcs2_la-dusb_vpkt.lo libticalcs2_la-nsp_rpkt.lo libticalcs2_la-nsp_vpkt.lo libticalcs2_la-probe.lo libticalcs2_la-romdump.lo libticalcs2_la-screen.lo libticalcs2_la-ticalcs.lo libticalcs2_la-tikeys.lo libticalcs2_la-type2str.lo libticalcs2_la-update.lo -lglib-2.0 -lticables2 -ltifiles2 -lticonv /bin/grep: /usr/lib/libarchive.la: No such file or directory /bin/sed: can't read /usr/lib/libarchive.la: No such file or directory libtool: error: '/usr/lib/libarchive.la' is not a valid libtool archive make[4]: *** [Makefile:548: libticalcs2.la] Error 1 make[4]: Leaving directory '/home/adam/.cache/pacaur/libticalcs/src/libticalcs2-1.1.9/src' make[3]: *** [Makefile:887: all-recursive] Error 1 make[3]: Leaving directory '/home/adam/.cache/pacaur/libticalcs/src/libticalcs2-1.1.9/src' make[2]: *** [Makefile:478: all] Error 2 make[2]: Leaving directory '/home/adam/.cache/pacaur/libticalcs/src/libticalcs2-1.1.9/src' make[1]: *** [Makefile:497: all-recursive] Error 1 make[1]: Leaving directory '/home/adam/.cache/pacaur/libticalcs/src/libticalcs2-1.1.9' make: *** [Makefile:406: all] Error 2 ==> ERROR: A failure occurred in build(). Aborting...

alex.henrie commented on 2017-04-01 18:31 (UTC)

Please add the following to the PKGBUILD: makedepends=(autoconf automake) This will avoid errors when installing this package with the `pacaur` helper.