Package Details: libwnck+-git 2.31.0.r34.gb1bee94-1

Git Clone URL: (read-only, click to copy)
Package Base: libwnck+-git
Description: Window Navigator Construction Kit
Upstream URL:
Licenses: LGPL
Conflicts: libwnck, libwnck+
Provides: libwnck, libwnck+
Submitter: bidulock
Maintainer: bidulock
Last Packager: bidulock
Votes: 4
Popularity: 0.000000
First Submitted: 2014-06-17 02:11 (UTC)
Last Updated: 2020-05-04 05:54 (UTC)

Required by (28)

Sources (1)

Latest Comments

bidulock commented on 2018-03-25 05:58 (UTC)

Issue was with gtk-doc. r22 builds correct in clean chroot on up to date system.

milkii commented on 2018-03-25 03:58 (UTC)

PKGBUILD is missing ./configure

that and ./ should be in prepare()

also, the two mv in the package() are for files that don't exist

milkii commented on 2018-03-21 17:45 (UTC)

Having an issue building this atm;

make[2]: Leaving directory '/var/tmp/trizen-milk/libwnck+-git/src/libwnck+-git/libwnck'
Making all in doc
make[2]: Entering directory '/var/tmp/trizen-milk/libwnck+-git/src/libwnck+-git/doc'
  DOC   Scanning header files
  DOC   Introspecting gobjects
usage: gtkdoc-scangobj [-h] [--version] --module MODULE [--types TYPES] [--type-init-func TYPE_INIT_FUNC] [--query-child-properties QUERY_CHILD_PROPERTIES]
                       [--output-dir OUTPUT_DIR] [--cc CC] [--ld LD] [--cflags CFLAGS] [--ldflags LDFLAGS] [--run RUN] [--verbose]
gtkdoc-scangobj: error: unrecognized arguments: --nogtkinit
make[2]: *** [Makefile:694: scan-build.stamp] Error 2
make[2]: Leaving directory '/var/tmp/trizen-milk/libwnck+-git/src/libwnck+-git/doc'
make[1]: *** [Makefile:556: all-recursive] Error 1
make[1]: Leaving directory '/var/tmp/trizen-milk/libwnck+-git/src/libwnck+-git'
make: *** [Makefile:463: all] Error 2
==> ERROR: A failure occurred in build().